BDBM19988 (2R,6S,7R)-10-(ethoxymethyl)-7-(4-hydroxyphenyl)-8-oxatricyclo[7.4.0.0^{2,6}]trideca-1(9),10,12-trien-12-ol::A-ring modified benzopyran scaffold, 2c
SMILES: CCOCc1cc(O)cc2[C@@H]3CCC[C@@H]3[C@@H](Oc12)c1ccc(O)cc1
InChI Key: InChIKey=PFCYQMFWFCEFGN-HBFSDRIKSA-N
Data: 2 KI
Activity Spreadsheet -- Enzyme Inhibition Constant Data from BindingDB
Found 2 hits for monomerid = 19988
Trg + Lig
Ki
nM
ΔG°
kcal/mole
IC50
nM
Kd
nM
EC50/IC50
nM
koff
s-1
kon
M-1s-1
pHTemp
°C
Estradiol receptor beta (ERβ)
(Homo sapiens (Human))
BDBM19988
((2R,6S,7R)-10-(ethoxymethyl)-7-(4-hydroxyphenyl)-8...)
Show SMILES CCOCc1cc(O)cc2[C@@H]3CCC[C@@H]3[C@@H](Oc12)c1ccc(O)cc1 |r|
Show InChI InChI=1S/C21H24O4/c1-2-24-12-14-10-16(23)11-19-17-4-3-5-18(17)20(25-21(14)19)13-6-8-15(22)9-7-13/h6-11,17-18,20,22-23H,2-5,12H2,1H3/t17-,18+,20+/m1/s1
0.745 -12.3n/an/an/an/an/a7.522
Lilly Research Laboratories
Assay Description
The binding affinities were determined by a competitive radiometric binding assay using [3H]estradiol as tracer. The Kd for 3H-estradiol was determin...
Bioorg Med Chem Lett 17: 5082-5 (2007)
Article DOI: 10.1016/j.bmcl.2007.07.009
BindingDB Entry DOI: 10.7270/Q27S7M2Q
Estrogen receptor
(Homo sapiens (Human))
BDBM19988
((2R,6S,7R)-10-(ethoxymethyl)-7-(4-hydroxyphenyl)-8...)
Show SMILES CCOCc1cc(O)cc2[C@@H]3CCC[C@@H]3[C@@H](Oc12)c1ccc(O)cc1 |r|
Show InChI InChI=1S/C21H24O4/c1-2-24-12-14-10-16(23)11-19-17-4-3-5-18(17)20(25-21(14)19)13-6-8-15(22)9-7-13/h6-11,17-18,20,22-23H,2-5,12H2,1H3/t17-,18+,20+/m1/s1
27.2 -10.2n/an/an/an/an/a7.522
Lilly Research Laboratories
Assay Description
The binding affinities were determined by a competitive radiometric binding assay using [3H]estradiol as tracer. The Kd for 3H-estradiol was determin...
Bioorg Med Chem Lett 17: 5082-5 (2007)
Article DOI: 10.1016/j.bmcl.2007.07.009
BindingDB Entry DOI: 10.7270/Q27S7M2Q