BDBM199891 US9226922, 528
SMILES: O[C@@H]1CCOc2ccccc2[C@@H]1NC(=O)Nc1cc2[nH]nc(OCC(F)F)c2cn1
InChI Key:
Data: 1 IC50
Activity Spreadsheet -- Enzyme Inhibition Constant Data from BindingDB
Found 1 hit for monomerid = 199891
Trg + Lig
Ki
nM
ΔG°
kcal/mole
IC50
nM
Kd
nM
EC50/IC50
nM
koff
s-1
kon
M-1s-1
pHTemp
°C
Mitogen-activated protein kinase 1
(Homo sapiens (Human))
BDBM199891
(US9226922, 528)
Show SMILES O[C@@H]1CCOc2ccccc2[C@@H]1NC(=O)Nc1cc2[nH]nc(OCC(F)F)c2cn1 |r|
NCI pathway
Reactome pathway
US Patent
n/an/a 0.600n/an/an/an/an/an/a
Merck Sharp & Dohme Corp.
US Patent
Assay Description
Activated ERK2 activity was determined in an IMAP-FP assay (Molecular Devices). Using this assay format, the potency (IC50) of each compound was dete...
US Patent US9226922 (2016)
BindingDB Entry DOI: 10.7270/Q2PG1QJW