BDBM199988 US9227959, 2
SMILES: Clc1cccc(c1)C#Cc1ccc(nc1)C(=O)N1CCOCC1
InChI Key: InChIKey=LBLXFRRQZJVWJO-UHFFFAOYSA-N
Data: 1 KI
Activity Spreadsheet -- Enzyme Inhibition Constant Data from BindingDB
Found 1 hit for monomerid = 199988
Trg + Lig
Ki
nM
ΔG°
kcal/mole
IC50
nM
Kd
nM
EC50/IC50
nM
koff
s-1
kon
M-1s-1
pHTemp
°C
Metabotropic glutamate receptor 5a (mGluR5)
(Homo sapiens (Human))
BDBM199988
(US9227959, 2)
Show SMILES Clc1cccc(c1)C#Cc1ccc(nc1)C(=O)N1CCOCC1
Show InChI InChI=1S/C18H15ClN2O2/c19-16-3-1-2-14(12-16)4-5-15-6-7-17(20-13-15)18(22)21-8-10-23-11-9-21/h1-3,6-7,12-13H,8-11H2
US Patent
19n/an/an/an/an/an/a7.4n/a
Hoffman-La Roche Inc.
US Patent
Assay Description
For binding experiments, cDNA encoding human mGlu 5a receptor was transiently transfected into EBNA cells using a procedure described by Schlaeger ...
US Patent US9227959 (2016)
BindingDB Entry DOI: 10.7270/Q25D8QNJ