BDBM20020 2-{4-[({3-[3-benzoyl-8-(trifluoromethyl)quinolin-4-yl]phenyl}amino)methyl]phenyl}propanoic acid::phenyl acetic acid based quinoline, 32
SMILES: CC(C(O)=O)c1ccc(CNc2cccc(c2)-c2c(cnc3c(cccc23)C(F)(F)F)C(=O)c2ccccc2)cc1
InChI Key: InChIKey=SQHRBEDYCPJCNA-UHFFFAOYSA-N
Data: 2 IC50  1 EC50
Activity Spreadsheet -- Enzyme Inhibition Constant Data from BindingDB
Found 2 hits for monomerid = 20020
Trg + Lig
Ki
nM
ΔG°
kcal/mole
IC50
nM
Kd
nM
EC50/IC50
nM
koff
s-1
kon
M-1s-1
pHTemp
°C
Liver X Receptor beta (LXR-beta)
(Homo sapiens (Human))
BDBM20020
(2-{4-[({3-[3-benzoyl-8-(trifluoromethyl)quinolin-4...)
Show SMILES CC(C(O)=O)c1ccc(CNc2cccc(c2)-c2c(cnc3c(cccc23)C(F)(F)F)C(=O)c2ccccc2)cc1
Show InChI InChI=1S/C33H25F3N2O3/c1-20(32(40)41)22-15-13-21(14-16-22)18-37-25-10-5-9-24(17-25)29-26-11-6-12-28(33(34,35)36)30(26)38-19-27(29)31(39)23-7-3-2-4-8-23/h2-17,19-20,37H,18H2,1H3,(H,40,41)
n/an/a 2.60n/a 58n/an/an/an/a
Wyeth Research
Assay Description
Binding reaction was initiated by adding a dilution series of test compound in tracer solution to LXR-coated flash plates. Each concentration of test...
Bioorg Med Chem 15: 3321-33 (2007)
Article DOI: 10.1016/j.bmc.2007.03.013
BindingDB Entry DOI: 10.7270/Q2VH5M37
Liver X Receptor alpha (LXR-alpha)
(Homo sapiens (Human))
BDBM20020
(2-{4-[({3-[3-benzoyl-8-(trifluoromethyl)quinolin-4...)
Show SMILES CC(C(O)=O)c1ccc(CNc2cccc(c2)-c2c(cnc3c(cccc23)C(F)(F)F)C(=O)c2ccccc2)cc1
Show InChI InChI=1S/C33H25F3N2O3/c1-20(32(40)41)22-15-13-21(14-16-22)18-37-25-10-5-9-24(17-25)29-26-11-6-12-28(33(34,35)36)30(26)38-19-27(29)31(39)23-7-3-2-4-8-23/h2-17,19-20,37H,18H2,1H3,(H,40,41)
Reactome pathway
n/an/a 15.2n/an/an/an/a7.44
Wyeth Research
Assay Description
Binding reaction was initiated by adding a dilution series of test compound in tracer solution to LXR-coated flash plates. Each concentration of test...
Bioorg Med Chem 15: 3321-33 (2007)
Article DOI: 10.1016/j.bmc.2007.03.013
BindingDB Entry DOI: 10.7270/Q2VH5M37