BDBM200227 cid_374010
SMILES: COCC(=O)OC1CCn2c1nc1c2C(=O)C(C)=C(NC(C)=O)C1=O
InChI Key: InChIKey=IEGPEJKOKNPIHK-UHFFFAOYSA-N
Data: 1 IC50
Activity Spreadsheet -- Enzyme Inhibition Constant Data from BindingDB
Found 1 hit for monomerid = 200227
Trg + Lig
Ki
nM
ΔG°
kcal/mole
IC50
nM
Kd
nM
EC50/IC50
nM
koff
s-1
kon
M-1s-1
pHTemp
°C
ELAV-like protein 1 [I180A]
(Homo sapiens (Human))
BDBM200227
(cid_374010)
Show SMILES COCC(=O)OC1CCn2c1nc1c2C(=O)C(C)=C(NC(C)=O)C1=O |t:19|
Show InChI InChI=1S/C16H17N3O6/c1-7-11(17-8(2)20)15(23)12-13(14(7)22)19-5-4-9(16(19)18-12)25-10(21)6-24-3/h9H,4-6H2,1-3H3,(H,17,20)
PCBioAssay
n/an/a 1.74E+4n/an/an/an/an/an/a
11762
Curated by PubChem BioAssay
PubChem Bioassay (2015)
BindingDB Entry DOI: 10.7270/Q2HQ3XQ7