BDBM200314 US9226927, 27a
SMILES: Fc1ccc(F)c2c1OCC1[C@H](CCS(=O)(=O)c3ccc[nH]c3=O)OCC[C@@]21S(=O)(=O)c1ccc(Cl)cc1
InChI Key:
Data: 1 IC50
Activity Spreadsheet -- Enzyme Inhibition Constant Data from BindingDB
Found 1 hit for monomerid = 200314
Trg + Lig
Ki
nM
ΔG°
kcal/mole
IC50
nM
Kd
nM
EC50/IC50
nM
koff
s-1
kon
M-1s-1
pHTemp
°C
Beta amyloid A4 protein
(Homo sapiens (Human))
BDBM200314
(US9226927, 27a)
Show SMILES Fc1ccc(F)c2c1OCC1[C@H](CCS(=O)(=O)c3ccc[nH]c3=O)OCC[C@@]21S(=O)(=O)c1ccc(Cl)cc1 |r|
Reactome pathway
US Patent
n/an/a 2.80n/an/an/an/a7.037
MERCK SHARP & DOHME CORP.
US Patent
Assay Description
To measure γ-secretase activity, membranes were incubated at 37° C. for 1 h in 50 μL of buffer containing 20 mM Hepes (pH 7.0) and 2 mM EDT...
US Patent US9226927 (2016)
BindingDB Entry DOI: 10.7270/Q24J0CX1