null
SMILES: Cc1nc2cnc3cc(F)c(cc3c2n1[C@H]1CCN(C[C@@H]1F)S(C)(=O)=O)-c1ccc(Oc2ncccn2)cc1Cl
InChI Key: InChIKey=VVIXOXWAEFXJFE-DHLKQENFSA-N
Activity Spreadsheet -- Enzyme Inhibition Constant Data from BindingDB
Found 2 hits for monomerid = 200423
Trg + Lig
Ki
nM
ΔG°
kcal/mole
IC50
nM
Kd
nM
EC50/IC50
nM
koff
s-1
kon
M-1s-1
pHTemp
°C
Dual specificity mitogen-activated protein kinase kinase 1
(Homo sapiens (Human))
BDBM200423
(US10011599, Example 50 | US9227969, 50)
Show SMILES Cc1nc2cnc3cc(F)c(cc3c2n1[C@H]1CCN(C[C@@H]1F)S(C)(=O)=O)-c1ccc(Oc2ncccn2)cc1Cl |r|
Show InChI InChI=1S/C27H23ClF2N6O3S/c1-15-34-24-13-33-23-12-21(29)18(17-5-4-16(10-20(17)28)39-27-31-7-3-8-32-27)11-19(23)26(24)36(15)25-6-9-35(14-22(25)30)40(2,37)38/h3-5,7-8,10-13,22,25H,6,9,14H2,1-2H3/t22-,25-/m0/s1
Reactome pathway
US Patent
n/an/a 12n/an/an/an/an/an/a
Astellas Pharma Inc.
Assay Description
[MEK1 1mM ATP IC50 uM] A BRAF-MEK-ERK cascade assay is used to evaluate the effects of these compounds as inhibitors of the MAP kinase pathway. An en...
Bioorg Med Chem 17: 3130-41 (2009)
BindingDB Entry DOI: 10.7270/Q2W37ZNG
Dual specificity mitogen-activated protein kinase kinase 1/Mitogen-activated protein kinase 1/Serine/threonine-protein kinase B-raf
(Homo sapiens (Human))
BDBM200423
(US10011599, Example 50 | US9227969, 50)
Show SMILES Cc1nc2cnc3cc(F)c(cc3c2n1[C@H]1CCN(C[C@@H]1F)S(C)(=O)=O)-c1ccc(Oc2ncccn2)cc1Cl |r|
Show InChI InChI=1S/C27H23ClF2N6O3S/c1-15-34-24-13-33-23-12-21(29)18(17-5-4-16(10-20(17)28)39-27-31-7-3-8-32-27)11-19(23)26(24)36(15)25-6-9-35(14-22(25)30)40(2,37)38/h3-5,7-8,10-13,22,25H,6,9,14H2,1-2H3/t22-,25-/m0/s1
US Patent
n/an/a 12n/an/an/an/a7.5n/a
NOVARTIS AG
US Patent
Assay Description
A BRAF-MEK-ERK cascade assay is used to evaluate the effects of these compounds as inhibitors of the MAP kinase pathway. An enzymatic cascade assay i...
US Patent US9227969 (2016)
BindingDB Entry DOI: 10.7270/Q2W094RM