BDBM200744 US9233108, 5::US9757383, Example 5
SMILES: CN(CCCc1nc(no1)-c1ccc(CNC[C@H](O)c2ccc(O)c3[nH]c(=O)ccc23)cc1)[C@H]1CC[C@@H](CC1)OC(=O)C(O)(c1cccs1)c1cccs1
InChI Key: InChIKey=DUFXKHQAHBTYTO-HPSLPFNASA-N
Data: 4 IC50
Activity Spreadsheet -- Enzyme Inhibition Constant Data from BindingDB
Found 4 hits for monomerid = 200744
Trg + Lig
Ki
nM
ΔG°
kcal/mole
IC50
nM
Kd
nM
EC50/IC50
nM
koff
s-1
kon
M-1s-1
pHTemp
°C
Beta-2 adrenergic receptor
(Homo sapiens (Human))
BDBM200744
(US9233108, 5 | US9757383, Example 5)
Show SMILES CN(CCCc1nc(no1)-c1ccc(CNC[C@H](O)c2ccc(O)c3[nH]c(=O)ccc23)cc1)[C@H]1CC[C@@H](CC1)OC(=O)C(O)(c1cccs1)c1cccs1 |wU:36.43,wD:17.18,33.36,(6.52,7.15,;4.99,6.98,;4.37,5.58,;5.27,4.33,;4.65,2.92,;5.55,1.68,;5.07,.21,;6.32,-.69,;7.57,.21,;7.09,1.68,;6.32,-2.23,;7.65,-3,;7.65,-4.54,;6.32,-5.31,;6.32,-6.85,;7.65,-7.62,;7.65,-9.16,;8.99,-9.93,;10.32,-9.16,;8.99,-11.47,;7.65,-12.24,;7.65,-13.78,;8.99,-14.55,;8.99,-16.09,;10.32,-13.78,;11.66,-14.55,;12.99,-13.78,;14.32,-14.55,;12.99,-12.24,;11.66,-11.47,;10.32,-12.24,;4.99,-4.54,;4.99,-3,;4.09,8.23,;4.71,9.64,;3.81,10.88,;2.28,10.72,;1.65,9.31,;2.56,8.07,;1.37,11.97,;-.16,11.81,;-.79,10.4,;-1.06,13.05,;.18,13.96,;-1.97,14.3,;-3.51,14.3,;-3.99,15.76,;-2.74,16.67,;-1.49,15.76,;-2.31,12.15,;-2.31,10.61,;-3.77,10.13,;-4.68,11.38,;-3.77,12.62,)|
Show InChI InChI=1S/C40H43N5O7S2/c1-45(27-12-14-28(15-13-27)51-39(49)40(50,33-5-3-21-53-33)34-6-4-22-54-34)20-2-7-36-43-38(44-52-36)26-10-8-25(9-11-26)23-41-24-32(47)29-16-18-31(46)37-30(29)17-19-35(48)42-37/h3-6,8-11,16-19,21-22,27-28,32,41,46-47,50H,2,7,12-15,20,23-24H2,1H3,(H,42,48)/t27-,28-,32-/m0/s1
Reactome pathway
US Patent
n/an/a 2.70n/an/an/an/an/a25
ALMIRALL, S.A.
US Patent
Assay Description
The study of binding to human adrenergic beta1 and beta2 receptors was performed using commercial membranes prepared from Sf9 cells where they are ov...
US Patent US9233108 (2016)
BindingDB Entry DOI: 10.7270/Q23J3BSN
Muscarinic acetylcholine receptor M3
(Homo sapiens (Human))
BDBM200744
(US9233108, 5 | US9757383, Example 5)
Show SMILES CN(CCCc1nc(no1)-c1ccc(CNC[C@H](O)c2ccc(O)c3[nH]c(=O)ccc23)cc1)[C@H]1CC[C@@H](CC1)OC(=O)C(O)(c1cccs1)c1cccs1 |wU:36.43,wD:17.18,33.36,(6.52,7.15,;4.99,6.98,;4.37,5.58,;5.27,4.33,;4.65,2.92,;5.55,1.68,;5.07,.21,;6.32,-.69,;7.57,.21,;7.09,1.68,;6.32,-2.23,;7.65,-3,;7.65,-4.54,;6.32,-5.31,;6.32,-6.85,;7.65,-7.62,;7.65,-9.16,;8.99,-9.93,;10.32,-9.16,;8.99,-11.47,;7.65,-12.24,;7.65,-13.78,;8.99,-14.55,;8.99,-16.09,;10.32,-13.78,;11.66,-14.55,;12.99,-13.78,;14.32,-14.55,;12.99,-12.24,;11.66,-11.47,;10.32,-12.24,;4.99,-4.54,;4.99,-3,;4.09,8.23,;4.71,9.64,;3.81,10.88,;2.28,10.72,;1.65,9.31,;2.56,8.07,;1.37,11.97,;-.16,11.81,;-.79,10.4,;-1.06,13.05,;.18,13.96,;-1.97,14.3,;-3.51,14.3,;-3.99,15.76,;-2.74,16.67,;-1.49,15.76,;-2.31,12.15,;-2.31,10.61,;-3.77,10.13,;-4.68,11.38,;-3.77,12.62,)|
Show InChI InChI=1S/C40H43N5O7S2/c1-45(27-12-14-28(15-13-27)51-39(49)40(50,33-5-3-21-53-33)34-6-4-22-54-34)20-2-7-36-43-38(44-52-36)26-10-8-25(9-11-26)23-41-24-32(47)29-16-18-31(46)37-30(29)17-19-35(48)42-37/h3-6,8-11,16-19,21-22,27-28,32,41,46-47,50H,2,7,12-15,20,23-24H2,1H3,(H,42,48)/t27-,28-,32-/m0/s1
Reactome pathway
US Patent
n/an/a 0.400n/an/an/an/an/an/a
Almirall, S.A.
US Patent
Assay Description
The study of binding to human muscarinic M1, M2, M3, M4 and M5 receptors was performed using commercial membranes (Perkin Elmer) prepared from CHO-K1...
US Patent US9757383 (2017)
BindingDB Entry DOI: 10.7270/Q2HX1FSN
Beta-2 adrenergic receptor
(Homo sapiens (Human))
BDBM200744
(US9233108, 5 | US9757383, Example 5)
Show SMILES CN(CCCc1nc(no1)-c1ccc(CNC[C@H](O)c2ccc(O)c3[nH]c(=O)ccc23)cc1)[C@H]1CC[C@@H](CC1)OC(=O)C(O)(c1cccs1)c1cccs1 |wU:36.43,wD:17.18,33.36,(6.52,7.15,;4.99,6.98,;4.37,5.58,;5.27,4.33,;4.65,2.92,;5.55,1.68,;5.07,.21,;6.32,-.69,;7.57,.21,;7.09,1.68,;6.32,-2.23,;7.65,-3,;7.65,-4.54,;6.32,-5.31,;6.32,-6.85,;7.65,-7.62,;7.65,-9.16,;8.99,-9.93,;10.32,-9.16,;8.99,-11.47,;7.65,-12.24,;7.65,-13.78,;8.99,-14.55,;8.99,-16.09,;10.32,-13.78,;11.66,-14.55,;12.99,-13.78,;14.32,-14.55,;12.99,-12.24,;11.66,-11.47,;10.32,-12.24,;4.99,-4.54,;4.99,-3,;4.09,8.23,;4.71,9.64,;3.81,10.88,;2.28,10.72,;1.65,9.31,;2.56,8.07,;1.37,11.97,;-.16,11.81,;-.79,10.4,;-1.06,13.05,;.18,13.96,;-1.97,14.3,;-3.51,14.3,;-3.99,15.76,;-2.74,16.67,;-1.49,15.76,;-2.31,12.15,;-2.31,10.61,;-3.77,10.13,;-4.68,11.38,;-3.77,12.62,)|
Show InChI InChI=1S/C40H43N5O7S2/c1-45(27-12-14-28(15-13-27)51-39(49)40(50,33-5-3-21-53-33)34-6-4-22-54-34)20-2-7-36-43-38(44-52-36)26-10-8-25(9-11-26)23-41-24-32(47)29-16-18-31(46)37-30(29)17-19-35(48)42-37/h3-6,8-11,16-19,21-22,27-28,32,41,46-47,50H,2,7,12-15,20,23-24H2,1H3,(H,42,48)/t27-,28-,32-/m0/s1
Reactome pathway
US Patent
n/an/a 2.70n/an/an/an/an/an/a
Almirall, S.A.
US Patent
Assay Description
The study of binding to human adrenergic beta1 and beta2 receptors was performed using commercial membranes prepared from Sf9 cells where they are ov...
US Patent US9757383 (2017)
BindingDB Entry DOI: 10.7270/Q2HX1FSN
Muscarinic acetylcholine receptor M3
(Homo sapiens (Human))
BDBM200744
(US9233108, 5 | US9757383, Example 5)
Show SMILES CN(CCCc1nc(no1)-c1ccc(CNC[C@H](O)c2ccc(O)c3[nH]c(=O)ccc23)cc1)[C@H]1CC[C@@H](CC1)OC(=O)C(O)(c1cccs1)c1cccs1 |wU:36.43,wD:17.18,33.36,(6.52,7.15,;4.99,6.98,;4.37,5.58,;5.27,4.33,;4.65,2.92,;5.55,1.68,;5.07,.21,;6.32,-.69,;7.57,.21,;7.09,1.68,;6.32,-2.23,;7.65,-3,;7.65,-4.54,;6.32,-5.31,;6.32,-6.85,;7.65,-7.62,;7.65,-9.16,;8.99,-9.93,;10.32,-9.16,;8.99,-11.47,;7.65,-12.24,;7.65,-13.78,;8.99,-14.55,;8.99,-16.09,;10.32,-13.78,;11.66,-14.55,;12.99,-13.78,;14.32,-14.55,;12.99,-12.24,;11.66,-11.47,;10.32,-12.24,;4.99,-4.54,;4.99,-3,;4.09,8.23,;4.71,9.64,;3.81,10.88,;2.28,10.72,;1.65,9.31,;2.56,8.07,;1.37,11.97,;-.16,11.81,;-.79,10.4,;-1.06,13.05,;.18,13.96,;-1.97,14.3,;-3.51,14.3,;-3.99,15.76,;-2.74,16.67,;-1.49,15.76,;-2.31,12.15,;-2.31,10.61,;-3.77,10.13,;-4.68,11.38,;-3.77,12.62,)|
Show InChI InChI=1S/C40H43N5O7S2/c1-45(27-12-14-28(15-13-27)51-39(49)40(50,33-5-3-21-53-33)34-6-4-22-54-34)20-2-7-36-43-38(44-52-36)26-10-8-25(9-11-26)23-41-24-32(47)29-16-18-31(46)37-30(29)17-19-35(48)42-37/h3-6,8-11,16-19,21-22,27-28,32,41,46-47,50H,2,7,12-15,20,23-24H2,1H3,(H,42,48)/t27-,28-,32-/m0/s1
Reactome pathway
US Patent
n/an/a 0.400n/an/an/an/an/an/a
ALMIRALL, S.A.
US Patent
Assay Description
The study of binding to human muscarinic M1, M2, M3, M4 and M5 receptors was performed using commercial membranes (Perkin Elmer) prepared from CHO-K1...
US Patent US9233108 (2016)
BindingDB Entry DOI: 10.7270/Q23J3BSN