BDBM200945 US9233946, 44
SMILES: Cc1c(sc2c(Cl)cccc12)S(=O)(=O)Nc1cccc(c1)C(O)=O
InChI Key: InChIKey=ORAJBSYKPBEKQG-UHFFFAOYSA-N
Data: 1 IC50
Activity Spreadsheet -- Enzyme Inhibition Constant Data from BindingDB
Found 1 hit for monomerid = 200945
Trg + Lig
Ki
nM
ΔG°
kcal/mole
IC50
nM
Kd
nM
EC50/IC50
nM
koff
s-1
kon
M-1s-1
pHTemp
°C
6-phosphofructo-2-kinase/fructose-2,6-bisphosphatase 4 (PFKFB4)
(Homo sapiens (Human))
BDBM200945
(US9233946, 44)
Show SMILES Cc1c(sc2c(Cl)cccc12)S(=O)(=O)Nc1cccc(c1)C(O)=O
Show InChI InChI=1S/C16H12ClNO4S2/c1-9-12-6-3-7-13(17)14(12)23-16(9)24(21,22)18-11-5-2-4-10(8-11)15(19)20/h2-8,18H,1H3,(H,19,20)
US Patent
n/an/a 200n/an/an/an/an/an/a
KANCERA AB
US Patent
Assay Description
Method B: The kinase activity of the bi-functional enzyme is readily quantified based on the production of ADP and F-2,6-P2 from ATP and F6P. The ADP...
US Patent US9233946 (2016)
BindingDB Entry DOI: 10.7270/Q2V123KB