BDBM20113 dipeptide-derived nitrile, 34::tert-butyl N-[(1S)-1-[(cyanomethyl)carbamoyl]-2-(naphthalen-2-yl)ethyl]carbamate
SMILES: CC(C)(C)OC(=O)N[C@@H](Cc1ccc2ccccc2c1)C(=O)NCC#N
InChI Key: InChIKey=ILOWUFANBJIDAV-KRWDZBQOSA-N
Data: 5 KI
Activity Spreadsheet -- Enzyme Inhibition Constant Data from BindingDB
Found 5 hits for monomerid = 20113
Trg + Lig
Ki
nM
ΔG°
kcal/mole
IC50
nM
Kd
nM
EC50/IC50
nM
koff
s-1
kon
M-1s-1
pHTemp
°C
Papain
(Carica papaya)
BDBM20113
(dipeptide-derived nitrile, 34 | tert-butyl N-[(1S)...)
Show SMILES CC(C)(C)OC(=O)N[C@@H](Cc1ccc2ccccc2c1)C(=O)NCC#N |r|
Show InChI InChI=1S/C20H23N3O3/c1-20(2,3)26-19(25)23-17(18(24)22-11-10-21)13-14-8-9-15-6-4-5-7-16(15)12-14/h4-9,12,17H,11,13H2,1-3H3,(H,22,24)(H,23,25)/t17-/m0/s1
21n/an/an/an/an/an/an/an/a
Rheinische Friedrich-Wilhelms-Universitat Bonn
Assay Description
Enzyme activities were calculated from kinetic measurements performed by spectrophotometric detection of the product p-nitroaniline (pNA) at waveleng...
J Med Chem 48: 7688-707 (2005)
Article DOI: 10.1021/jm050686b
BindingDB Entry DOI: 10.7270/Q2GB22BG
Cathepsin S
(Homo sapiens (Human))
BDBM20113
(dipeptide-derived nitrile, 34 | tert-butyl N-[(1S)...)
Show SMILES CC(C)(C)OC(=O)N[C@@H](Cc1ccc2ccccc2c1)C(=O)NCC#N |r|
Show InChI InChI=1S/C20H23N3O3/c1-20(2,3)26-19(25)23-17(18(24)22-11-10-21)13-14-8-9-15-6-4-5-7-16(15)12-14/h4-9,12,17H,11,13H2,1-3H3,(H,22,24)(H,23,25)/t17-/m0/s1
Reactome pathway
83n/an/an/an/an/an/an/an/a
Rheinische Friedrich-Wilhelms-Universitat Bonn
Assay Description
Enzyme activities were calculated from kinetic measurements performed by fluorimetric detection of the product AMC at the wavelengths for excitation ...
J Med Chem 48: 7688-707 (2005)
Article DOI: 10.1021/jm050686b
BindingDB Entry DOI: 10.7270/Q2GB22BG
Cathepsin L
(Bos taurus (bovine))
BDBM20113
(dipeptide-derived nitrile, 34 | tert-butyl N-[(1S)...)
Show SMILES CC(C)(C)OC(=O)N[C@@H](Cc1ccc2ccccc2c1)C(=O)NCC#N |r|
Show InChI InChI=1S/C20H23N3O3/c1-20(2,3)26-19(25)23-17(18(24)22-11-10-21)13-14-8-9-15-6-4-5-7-16(15)12-14/h4-9,12,17H,11,13H2,1-3H3,(H,22,24)(H,23,25)/t17-/m0/s1
Reactome pathway
120n/an/an/an/an/an/an/an/a
Rheinische Friedrich-Wilhelms-Universitat Bonn
Assay Description
Enzyme activities were calculated from kinetic measurements performed by fluorimetric detection of the product AMC at the wavelengths for excitation ...
J Med Chem 48: 7688-707 (2005)
Article DOI: 10.1021/jm050686b
BindingDB Entry DOI: 10.7270/Q2GB22BG
Cathepsin B
(Homo sapiens (Human))
BDBM20113
(dipeptide-derived nitrile, 34 | tert-butyl N-[(1S)...)
Show SMILES CC(C)(C)OC(=O)N[C@@H](Cc1ccc2ccccc2c1)C(=O)NCC#N |r|
Show InChI InChI=1S/C20H23N3O3/c1-20(2,3)26-19(25)23-17(18(24)22-11-10-21)13-14-8-9-15-6-4-5-7-16(15)12-14/h4-9,12,17H,11,13H2,1-3H3,(H,22,24)(H,23,25)/t17-/m0/s1
Reactome pathway
3.46E+3n/an/an/an/an/an/a6.0n/a
University of Bonn
Curated by ChEMBL
Assay Description
Inhibition of human liver cathepsin B using Cbz-Arg-Arg-pNA as substrate at pH 6 incubated for 30 mins measured for 20 mins by photometrical analysis
ACS Med Chem Lett 7: 211-6 (2016)
BindingDB Entry DOI: 10.7270/Q2TH8PMM
Cathepsin K
(Homo sapiens (Human))
BDBM20113
(dipeptide-derived nitrile, 34 | tert-butyl N-[(1S)...)
Show SMILES CC(C)(C)OC(=O)N[C@@H](Cc1ccc2ccccc2c1)C(=O)NCC#N |r|
Show InChI InChI=1S/C20H23N3O3/c1-20(2,3)26-19(25)23-17(18(24)22-11-10-21)13-14-8-9-15-6-4-5-7-16(15)12-14/h4-9,12,17H,11,13H2,1-3H3,(H,22,24)(H,23,25)/t17-/m0/s1
Reactome pathway
8.30E+4n/an/an/an/an/an/an/an/a
Rheinische Friedrich-Wilhelms-Universitat Bonn
Assay Description
Enzyme activities were calculated from kinetic measurements performed by fluorimetric detection of the product AMC at the wavelengths for excitation ...
J Med Chem 48: 7688-707 (2005)
Article DOI: 10.1021/jm050686b
BindingDB Entry DOI: 10.7270/Q2GB22BG