BDBM201132 US9233953, 93
SMILES: Clc1ccc(s1)C1CN(CCN1C(=O)C1CCS(=O)(=O)CC1)c1ncc(cn1)C1CC1
InChI Key: InChIKey=HFJJZTJJBMGMOE-UHFFFAOYSA-N
Data: 1 IC50
Activity Spreadsheet -- Enzyme Inhibition Constant Data from BindingDB
Found 1 hit for monomerid = 201132
Trg + Lig
Ki
nM
ΔG°
kcal/mole
IC50
nM
Kd
nM
EC50/IC50
nM
koff
s-1
kon
M-1s-1
pHTemp
°C
Glycine transporter 1
(Homo sapiens (Human))
BDBM201132
(US9233953, 93)
Show SMILES Clc1ccc(s1)C1CN(CCN1C(=O)C1CCS(=O)(=O)CC1)c1ncc(cn1)C1CC1
Show InChI InChI=1S/C21H25ClN4O3S2/c22-19-4-3-18(30-19)17-13-25(21-23-11-16(12-24-21)14-1-2-14)7-8-26(17)20(27)15-5-9-31(28,29)10-6-15/h3-4,11-12,14-15,17H,1-2,5-10,13H2
US Patent
n/an/a 8n/an/an/an/an/an/a
Boehringer Ingelheim International GmbH
US Patent
Assay Description
Cells expressing either endogenously the GlyT1 transporter like JAR cells (human placental choriocarcinoma cells; e.g. WO 2008/002583) or SK-N-MC cel...
US Patent US9233953 (2016)
BindingDB Entry DOI: 10.7270/Q2Q81BVM