BDBM20119 (2S)-N-(cyanomethyl)-3-phenyl-2-(phenylformamido)propanamide::phenylalanine derivative, 43
SMILES: O=C(NCC#N)[C@H](Cc1ccccc1)NC(=O)c1ccccc1
InChI Key: InChIKey=WEIUVZVWLANUJJ-INIZCTEOSA-N
Data: 5 KI  1 IC50
Activity Spreadsheet -- Enzyme Inhibition Constant Data from BindingDB
Found 9 hits for monomerid = 20119
Trg + Lig
Ki
nM
ΔG°
kcal/mole
IC50
nM
Kd
nM
EC50/IC50
nM
koff
s-1
kon
M-1s-1
pHTemp
°C
Papain
(Carica papaya)
BDBM20119
((2S)-N-(cyanomethyl)-3-phenyl-2-(phenylformamido)p...)
Show SMILES O=C(NCC#N)[C@H](Cc1ccccc1)NC(=O)c1ccccc1 |r|
Show InChI InChI=1S/C18H17N3O2/c19-11-12-20-18(23)16(13-14-7-3-1-4-8-14)21-17(22)15-9-5-2-6-10-15/h1-10,16H,12-13H2,(H,20,23)(H,21,22)/t16-/m0/s1
62n/an/an/an/an/an/an/an/a
Rheinische Friedrich-Wilhelms-Universitat Bonn
Assay Description
Enzyme activities were calculated from kinetic measurements performed by spectrophotometric detection of the product p-nitroaniline (pNA) at waveleng...
J Med Chem 48: 7688-707 (2005)
Article DOI: 10.1021/jm050686b
BindingDB Entry DOI: 10.7270/Q2GB22BG
Cathepsin S
(Homo sapiens (Human))
BDBM20119
((2S)-N-(cyanomethyl)-3-phenyl-2-(phenylformamido)p...)
Show SMILES O=C(NCC#N)[C@H](Cc1ccccc1)NC(=O)c1ccccc1 |r|
Show InChI InChI=1S/C18H17N3O2/c19-11-12-20-18(23)16(13-14-7-3-1-4-8-14)21-17(22)15-9-5-2-6-10-15/h1-10,16H,12-13H2,(H,20,23)(H,21,22)/t16-/m0/s1
Reactome pathway
77n/an/an/an/an/an/an/an/a
Rheinische Friedrich-Wilhelms-Universitat Bonn
Assay Description
Enzyme activities were calculated from kinetic measurements performed by fluorimetric detection of the product AMC at the wavelengths for excitation ...
J Med Chem 48: 7688-707 (2005)
Article DOI: 10.1021/jm050686b
BindingDB Entry DOI: 10.7270/Q2GB22BG
Procathepsin L
(Homo sapiens (Human))
BDBM20119
((2S)-N-(cyanomethyl)-3-phenyl-2-(phenylformamido)p...)
Show SMILES O=C(NCC#N)[C@H](Cc1ccccc1)NC(=O)c1ccccc1 |r|
Show InChI InChI=1S/C18H17N3O2/c19-11-12-20-18(23)16(13-14-7-3-1-4-8-14)21-17(22)15-9-5-2-6-10-15/h1-10,16H,12-13H2,(H,20,23)(H,21,22)/t16-/m0/s1
Reactome pathway
126n/an/an/an/an/an/an/an/a
TBA
Citation and Details
Cathepsin L
(Bos taurus (bovine))
BDBM20119
((2S)-N-(cyanomethyl)-3-phenyl-2-(phenylformamido)p...)
Show SMILES O=C(NCC#N)[C@H](Cc1ccccc1)NC(=O)c1ccccc1 |r|
Show InChI InChI=1S/C18H17N3O2/c19-11-12-20-18(23)16(13-14-7-3-1-4-8-14)21-17(22)15-9-5-2-6-10-15/h1-10,16H,12-13H2,(H,20,23)(H,21,22)/t16-/m0/s1
Reactome pathway
230n/an/an/an/an/an/an/an/a
Rheinische Friedrich-Wilhelms-Universitat Bonn
Assay Description
Enzyme activities were calculated from kinetic measurements performed by fluorimetric detection of the product AMC at the wavelengths for excitation ...
J Med Chem 48: 7688-707 (2005)
Article DOI: 10.1021/jm050686b
BindingDB Entry DOI: 10.7270/Q2GB22BG
Cathepsin B
(Homo sapiens (Human))
BDBM20119
((2S)-N-(cyanomethyl)-3-phenyl-2-(phenylformamido)p...)
Show SMILES O=C(NCC#N)[C@H](Cc1ccccc1)NC(=O)c1ccccc1 |r|
Show InChI InChI=1S/C18H17N3O2/c19-11-12-20-18(23)16(13-14-7-3-1-4-8-14)21-17(22)15-9-5-2-6-10-15/h1-10,16H,12-13H2,(H,20,23)(H,21,22)/t16-/m0/s1
Reactome pathway
>330n/an/an/an/an/an/a6.0n/a
University of Bonn
Curated by ChEMBL
Assay Description
Inhibition of human liver cathepsin B using Cbz-Arg-Arg-pNA as substrate at pH 6 incubated for 30 mins measured for 20 mins by photometrical analysis
ACS Med Chem Lett 7: 211-6 (2016)
BindingDB Entry DOI: 10.7270/Q2TH8PMM
Cruzipain
(Trypanosoma cruzi)
BDBM20119
((2S)-N-(cyanomethyl)-3-phenyl-2-(phenylformamido)p...)
Show SMILES O=C(NCC#N)[C@H](Cc1ccccc1)NC(=O)c1ccccc1 |r|
Show InChI InChI=1S/C18H17N3O2/c19-11-12-20-18(23)16(13-14-7-3-1-4-8-14)21-17(22)15-9-5-2-6-10-15/h1-10,16H,12-13H2,(H,20,23)(H,21,22)/t16-/m0/s1
501n/an/an/an/an/an/an/an/a
TBA
Citation and Details
Cruzipain
(Trypanosoma cruzi)
BDBM20119
((2S)-N-(cyanomethyl)-3-phenyl-2-(phenylformamido)p...)
Show SMILES O=C(NCC#N)[C@H](Cc1ccccc1)NC(=O)c1ccccc1 |r|
Show InChI InChI=1S/C18H17N3O2/c19-11-12-20-18(23)16(13-14-7-3-1-4-8-14)21-17(22)15-9-5-2-6-10-15/h1-10,16H,12-13H2,(H,20,23)(H,21,22)/t16-/m0/s1
501n/an/an/an/an/an/an/an/a
TBA
Citation and Details
Cathepsin K
(Homo sapiens (Human))
BDBM20119
((2S)-N-(cyanomethyl)-3-phenyl-2-(phenylformamido)p...)
Show SMILES O=C(NCC#N)[C@H](Cc1ccccc1)NC(=O)c1ccccc1 |r|
Show InChI InChI=1S/C18H17N3O2/c19-11-12-20-18(23)16(13-14-7-3-1-4-8-14)21-17(22)15-9-5-2-6-10-15/h1-10,16H,12-13H2,(H,20,23)(H,21,22)/t16-/m0/s1
Reactome pathway
1.50E+3n/an/an/an/an/an/an/an/a
Rheinische Friedrich-Wilhelms-Universitat Bonn
Assay Description
Enzyme activities were calculated from kinetic measurements performed by fluorimetric detection of the product AMC at the wavelengths for excitation ...
J Med Chem 48: 7688-707 (2005)
Article DOI: 10.1021/jm050686b
BindingDB Entry DOI: 10.7270/Q2GB22BG
Papain
(Carica papaya)
BDBM20119
((2S)-N-(cyanomethyl)-3-phenyl-2-(phenylformamido)p...)
Show SMILES O=C(NCC#N)[C@H](Cc1ccccc1)NC(=O)c1ccccc1 |r|
Show InChI InChI=1S/C18H17N3O2/c19-11-12-20-18(23)16(13-14-7-3-1-4-8-14)21-17(22)15-9-5-2-6-10-15/h1-10,16H,12-13H2,(H,20,23)(H,21,22)/t16-/m0/s1
n/an/a 360n/an/an/an/an/an/a
Radboud University Nijmegen
Curated by ChEMBL
Assay Description
Inhibition of papaya papain using Z-Phe-Arg-pNA substrate by spectrophotometry
Bioorg Med Chem 22: 5593-603 (2014)
Article DOI: 10.1016/j.bmc.2014.06.001
BindingDB Entry DOI: 10.7270/Q22N53X1