BDBM2015 2-ethyl-5-(5-methoxy-1H-indol-3-yl)-9-methyl-2,4,9,15-tetraazatricyclo[9.4.0.0^{3,8}]pentadeca-1(11),3(8),4,6,12,14-hexaen-10-one::2-indolyl dipyridodiazepinone 7b::5,11-Dihydro-11-ethyl-2-(5-methoxyindol-3-yl)-5-methyl-6H-dipyrido[3,2-b:2 ,3 -e][1,4]diazepin-6-one
SMILES: CCN1c2nc(ccc2N(C)C(=O)c2cccnc12)-c1c[nH]c2ccc(OC)cc12
InChI Key: InChIKey=FAUYKFLHHWFNGE-UHFFFAOYSA-N
Data: 7 IC50
Activity Spreadsheet -- Enzyme Inhibition Constant Data from BindingDB
Found 7 hits for monomerid = 2015
Trg + Lig
Ki
nM
ΔG°
kcal/mole
IC50
nM
Kd
nM
EC50/IC50
nM
koff
s-1
kon
M-1s-1
pHTemp
°C
HIV-1 Reverse Transcriptase
(Human immunodeficiency virus type 1)
BDBM2015
(2-ethyl-5-(5-methoxy-1H-indol-3-yl)-9-methyl-2,4,9...)
Show SMILES CCN1c2nc(ccc2N(C)C(=O)c2cccnc12)-c1c[nH]c2ccc(OC)cc12
Show InChI InChI=1S/C23H21N5O2/c1-4-28-21-15(6-5-11-24-21)23(29)27(2)20-10-9-19(26-22(20)28)17-13-25-18-8-7-14(30-3)12-16(17)18/h5-13,25H,4H2,1-3H3
n/an/a 200n/an/an/an/a7.822
Boehringer Ingelheim Pharmaceuticals Inc.
Assay Description
The IC50 of reverse transcriptase is the concentration that inhibits 50% of recombinant HIV-1 RT RNA-directed DNA polymerase activity in vitro.
J Med Chem 40: 2430-3 (1997)
Article DOI: 10.1021/jm960837y
BindingDB Entry DOI: 10.7270/Q2P26W9K
HIV-1 Reverse Transcriptase Mutant (Y181C)
(Human immunodeficiency virus type 1)
BDBM2015
(2-ethyl-5-(5-methoxy-1H-indol-3-yl)-9-methyl-2,4,9...)
Show SMILES CCN1c2nc(ccc2N(C)C(=O)c2cccnc12)-c1c[nH]c2ccc(OC)cc12
Show InChI InChI=1S/C23H21N5O2/c1-4-28-21-15(6-5-11-24-21)23(29)27(2)20-10-9-19(26-22(20)28)17-13-25-18-8-7-14(30-3)12-16(17)18/h5-13,25H,4H2,1-3H3
n/an/a 230n/an/an/an/a7.822
Boehringer Ingelheim Pharmaceuticals Inc.
Assay Description
The IC50 of reverse transcriptase is the concentration that inhibits 50% of recombinant HIV-1 RT RNA-directed DNA polymerase activity in vitro.
J Med Chem 40: 2430-3 (1997)
Article DOI: 10.1021/jm960837y
BindingDB Entry DOI: 10.7270/Q2P26W9K
HIV-1 Reverse Transcriptase Mutant (Y188L)
(Human immunodeficiency virus type 1)
BDBM2015
(2-ethyl-5-(5-methoxy-1H-indol-3-yl)-9-methyl-2,4,9...)
Show SMILES CCN1c2nc(ccc2N(C)C(=O)c2cccnc12)-c1c[nH]c2ccc(OC)cc12
Show InChI InChI=1S/C23H21N5O2/c1-4-28-21-15(6-5-11-24-21)23(29)27(2)20-10-9-19(26-22(20)28)17-13-25-18-8-7-14(30-3)12-16(17)18/h5-13,25H,4H2,1-3H3
n/an/a 730n/an/an/an/a7.822
Boehringer Ingelheim Pharmaceuticals Inc.
Assay Description
The IC50 of reverse transcriptase is the concentration that inhibits 50% of recombinant HIV-1 RT RNA-directed DNA polymerase activity in vitro.
J Med Chem 40: 2430-3 (1997)
Article DOI: 10.1021/jm960837y
BindingDB Entry DOI: 10.7270/Q2P26W9K
HIV-1 Reverse Transcriptase Mutant (P236L)
(Human immunodeficiency virus type 1)
BDBM2015
(2-ethyl-5-(5-methoxy-1H-indol-3-yl)-9-methyl-2,4,9...)
Show SMILES CCN1c2nc(ccc2N(C)C(=O)c2cccnc12)-c1c[nH]c2ccc(OC)cc12
Show InChI InChI=1S/C23H21N5O2/c1-4-28-21-15(6-5-11-24-21)23(29)27(2)20-10-9-19(26-22(20)28)17-13-25-18-8-7-14(30-3)12-16(17)18/h5-13,25H,4H2,1-3H3
n/an/a 404n/an/an/an/an/an/a
Boehringer Ingelheim Pharmaceuticals Inc.
Assay Description
The IC50 of reverse transcriptase is the concentration that inhibits 50% of recombinant HIV-1 RT RNA-directed DNA polymerase activity in vitro.
J Med Chem 40: 2430-3 (1997)
Article DOI: 10.1021/jm960837y
BindingDB Entry DOI: 10.7270/Q2P26W9K
HIV-1 Reverse Transcriptase Mutant (V106A)
(Human immunodeficiency virus type 1)
BDBM2015
(2-ethyl-5-(5-methoxy-1H-indol-3-yl)-9-methyl-2,4,9...)
Show SMILES CCN1c2nc(ccc2N(C)C(=O)c2cccnc12)-c1c[nH]c2ccc(OC)cc12
Show InChI InChI=1S/C23H21N5O2/c1-4-28-21-15(6-5-11-24-21)23(29)27(2)20-10-9-19(26-22(20)28)17-13-25-18-8-7-14(30-3)12-16(17)18/h5-13,25H,4H2,1-3H3
n/an/a 3.09E+3n/an/an/an/an/an/a
Boehringer Ingelheim Pharmaceuticals Inc.
Assay Description
The IC50 of reverse transcriptase is the concentration that inhibits 50% of recombinant HIV-1 RT RNA-directed DNA polymerase activity in vitro.
J Med Chem 40: 2430-3 (1997)
Article DOI: 10.1021/jm960837y
BindingDB Entry DOI: 10.7270/Q2P26W9K
HIV-1 Reverse Transcriptase Mutant (G190A)
(Human immunodeficiency virus type 1)
BDBM2015
(2-ethyl-5-(5-methoxy-1H-indol-3-yl)-9-methyl-2,4,9...)
Show SMILES CCN1c2nc(ccc2N(C)C(=O)c2cccnc12)-c1c[nH]c2ccc(OC)cc12
Show InChI InChI=1S/C23H21N5O2/c1-4-28-21-15(6-5-11-24-21)23(29)27(2)20-10-9-19(26-22(20)28)17-13-25-18-8-7-14(30-3)12-16(17)18/h5-13,25H,4H2,1-3H3
n/an/a 600n/an/an/an/an/an/a
Boehringer Ingelheim Pharmaceuticals Inc.
Assay Description
The IC50 of reverse transcriptase is the concentration that inhibits 50% of recombinant HIV-1 RT RNA-directed DNA polymerase activity in vitro.
J Med Chem 40: 2430-3 (1997)
Article DOI: 10.1021/jm960837y
BindingDB Entry DOI: 10.7270/Q2P26W9K
HIV-1 Reverse Transcriptase Mutant (K103N)
(Human immunodeficiency virus type 1)
BDBM2015
(2-ethyl-5-(5-methoxy-1H-indol-3-yl)-9-methyl-2,4,9...)
Show SMILES CCN1c2nc(ccc2N(C)C(=O)c2cccnc12)-c1c[nH]c2ccc(OC)cc12
Show InChI InChI=1S/C23H21N5O2/c1-4-28-21-15(6-5-11-24-21)23(29)27(2)20-10-9-19(26-22(20)28)17-13-25-18-8-7-14(30-3)12-16(17)18/h5-13,25H,4H2,1-3H3
n/an/a 935n/an/an/an/an/an/a
Boehringer Ingelheim Pharmaceuticals Inc.
Assay Description
The IC50 of reverse transcriptase is the concentration that inhibits 50% of recombinant HIV-1 RT RNA-directed DNA polymerase activity in vitro.
J Med Chem 40: 2430-3 (1997)
Article DOI: 10.1021/jm960837y
BindingDB Entry DOI: 10.7270/Q2P26W9K