BDBM201668 BDBM202039::US9233979, 96
SMILES: C[C@@H](O)[C@@H](NC(=O)Nc1cc2[nH]nc(N3CCOCC3)c2cn1)c1ccccc1
InChI Key:
Data: 2 IC50
Activity Spreadsheet -- Enzyme Inhibition Constant Data from BindingDB
Found 2 hits for monomerid = 201668
Trg + Lig
Ki
nM
ΔG°
kcal/mole
IC50
nM
Kd
nM
EC50/IC50
nM
koff
s-1
kon
M-1s-1
pHTemp
°C
Mitogen-activated protein kinase 1
(Homo sapiens (Human))
BDBM201668
(BDBM202039 | US9233979, 96)
Show SMILES C[C@@H](O)[C@@H](NC(=O)Nc1cc2[nH]nc(N3CCOCC3)c2cn1)c1ccccc1 |r|
NCI pathway
Reactome pathway
US Patent
n/an/a 0.400n/an/an/an/an/an/a
Merck Sharp & Dohme Corp.
US Patent
Assay Description
Activated ERK2 activity was determined in an IMAP-FP assay (Molecular Devices). Using this assay format, the potency (IC50) of each compound was de...
US Patent US9233979 (2016)
BindingDB Entry DOI: 10.7270/Q2B27T3B
Mitogen-activated protein kinase 1
(Homo sapiens (Human))
BDBM201668
(BDBM202039 | US9233979, 96)
Show SMILES C[C@@H](O)[C@@H](NC(=O)Nc1cc2[nH]nc(N3CCOCC3)c2cn1)c1ccccc1 |r|
NCI pathway
Reactome pathway
US Patent
n/an/a 0.300n/an/an/an/an/an/a
Merck Sharp & Dohme Corp.
US Patent
Assay Description
Activated ERK2 activity was determined in an IMAP-FP assay (Molecular Devices). Using this assay format, the potency (IC50) of each compound was de...
US Patent US9233979 (2016)
BindingDB Entry DOI: 10.7270/Q2B27T3B