BDBM202117 US9233983, D-9
SMILES: CN1CCC(CC1)n1cc(cn1)-c1cc2c(ncnc2[nH]1)-c1cccc(c1CO)-n1ncc2cc(ccc2c1=O)C1CC1
InChI Key: InChIKey=OOFNTWADTNPACE-UHFFFAOYSA-N
Data: 1 IC50
Activity Spreadsheet -- Enzyme Inhibition Constant Data from BindingDB
Found 1 hit for monomerid = 202117
Trg + Lig
Ki
nM
ΔG°
kcal/mole
IC50
nM
Kd
nM
EC50/IC50
nM
koff
s-1
kon
M-1s-1
pHTemp
°C
Tyrosine-protein kinase BTK
(Homo sapiens (Human))
BDBM202117
(US9233983, D-9)
Show SMILES CN1CCC(CC1)n1cc(cn1)-c1cc2c(ncnc2[nH]1)-c1cccc(c1CO)-n1ncc2cc(ccc2c1=O)C1CC1
Show InChI InChI=1S/C33H32N8O2/c1-39-11-9-24(10-12-39)40-17-23(16-36-40)29-14-27-31(34-19-35-32(27)38-29)26-3-2-4-30(28(26)18-42)41-33(43)25-8-7-21(20-5-6-20)13-22(25)15-37-41/h2-4,7-8,13-17,19-20,24,42H,5-6,9-12,18H2,1H3,(H,34,35,38)
NCI pathway
Reactome pathway
US Patent
n/an/a 2n/an/an/an/an/an/a
ADVINUS THERAPEUTICS LIMITED
US Patent
Assay Description
The inhibition assays were performed using the generic tyrosine kinase assay kit from C is Bio (HTRF KinEASE-TK #62TK0PEB). The assay is based on t...
US Patent US9233983 (2016)
BindingDB Entry DOI: 10.7270/Q22J69PQ