BDBM202131 US9233983, I-2
SMILES: CN1CCN(Cc2ccc(nc2)-c2cc3c(ccnc3[nH]2)-c2cccc(N3CCOc4cc(cc(F)c4C3=O)C3CC3)c2CO)CC1
InChI Key: InChIKey=CZRBWWRXBQATBP-UHFFFAOYSA-N
Data: 3 IC50
Activity Spreadsheet -- Enzyme Inhibition Constant Data from BindingDB
Found 3 hits for monomerid = 202131
Trg + Lig
Ki
nM
ΔG°
kcal/mole
IC50
nM
Kd
nM
EC50/IC50
nM
koff
s-1
kon
M-1s-1
pHTemp
°C
Tyrosine-protein kinase BTK
(Homo sapiens (Human))
BDBM202131
(US9233983, I-2)
Show SMILES CN1CCN(Cc2ccc(nc2)-c2cc3c(ccnc3[nH]2)-c2cccc(N3CCOc4cc(cc(F)c4C3=O)C3CC3)c2CO)CC1
Show InChI InChI=1S/C37H37FN6O3/c1-42-11-13-43(14-12-42)21-23-5-8-31(40-20-23)32-19-28-27(9-10-39-36(28)41-32)26-3-2-4-33(29(26)22-45)44-15-16-47-34-18-25(24-6-7-24)17-30(38)35(34)37(44)46/h2-5,8-10,17-20,24,45H,6-7,11-16,21-22H2,1H3,(H,39,41)
NCI pathway
Reactome pathway
US Patent
n/an/a 1n/an/an/an/an/an/a
ADVINUS THERAPEUTICS LIMITED
US Patent
Assay Description
The inhibition assays were performed using the generic tyrosine kinase assay kit from C is Bio (HTRF KinEASE-TK #62TK0PEB). The assay is based on t...
US Patent US9233983 (2016)
BindingDB Entry DOI: 10.7270/Q22J69PQ
Tyrosine-protein kinase BTK
(Mus musculus)
BDBM202131
(US9233983, I-2)
Show SMILES CN1CCN(Cc2ccc(nc2)-c2cc3c(ccnc3[nH]2)-c2cccc(N3CCOc4cc(cc(F)c4C3=O)C3CC3)c2CO)CC1
Show InChI InChI=1S/C37H37FN6O3/c1-42-11-13-43(14-12-42)21-23-5-8-31(40-20-23)32-19-28-27(9-10-39-36(28)41-32)26-3-2-4-33(29(26)22-45)44-15-16-47-34-18-25(24-6-7-24)17-30(38)35(34)37(44)46/h2-5,8-10,17-20,24,45H,6-7,11-16,21-22H2,1H3,(H,39,41)
n/an/a 5.5n/an/an/an/an/an/a
Advinus Therapeutics Ltd
Curated by ChEMBL
Assay Description
Inhibition of C57BL/6J mouse BTK assessed as decrease in anti-mouse IgM antibody stimulated BCR mediated CD69 upregulation preincubated for 30 mins f...
Bioorg Med Chem Lett 27: 1867-1873 (2017)
Article DOI: 10.1016/j.bmcl.2017.02.026
BindingDB Entry DOI: 10.7270/Q2K35X74
Tyrosine-protein kinase BTK
(Homo sapiens (Human))
BDBM202131
(US9233983, I-2)
Show SMILES CN1CCN(Cc2ccc(nc2)-c2cc3c(ccnc3[nH]2)-c2cccc(N3CCOc4cc(cc(F)c4C3=O)C3CC3)c2CO)CC1
Show InChI InChI=1S/C37H37FN6O3/c1-42-11-13-43(14-12-42)21-23-5-8-31(40-20-23)32-19-28-27(9-10-39-36(28)41-32)26-3-2-4-33(29(26)22-45)44-15-16-47-34-18-25(24-6-7-24)17-30(38)35(34)37(44)46/h2-5,8-10,17-20,24,45H,6-7,11-16,21-22H2,1H3,(H,39,41)
NCI pathway
Reactome pathway
n/an/a 1n/an/an/an/an/an/a
Advinus Therapeutics Ltd
Curated by ChEMBL
Assay Description
Inhibition of recombinant human full length BTK preincubated for 10 mins followed by Tk-biotin peptide substrate addition after 90 mins by TR-FRET as...
Bioorg Med Chem Lett 27: 1867-1873 (2017)
Article DOI: 10.1016/j.bmcl.2017.02.026
BindingDB Entry DOI: 10.7270/Q2K35X74