null
SMILES: OCc1c(cc(F)cc1-c1ccnc2[nH]c(CN3CCN(CC3)C3COC3)cc12)N1CCOc2cc(cc(F)c2C1=O)C1CC1
InChI Key: InChIKey=HTFJBXDZFBTPJU-UHFFFAOYSA-N
Activity Spreadsheet -- Enzyme Inhibition Constant Data from BindingDB
Found 1 hit for monomerid = 202147
Trg + Lig
Ki
nM
ΔG°
kcal/mole
IC50
nM
Kd
nM
EC50/IC50
nM
koff
s-1
kon
M-1s-1
pHTemp
°C
Tyrosine-protein kinase BTK
(Homo sapiens (Human))
BDBM202147
(US9233983, I-17)
Show SMILES OCc1c(cc(F)cc1-c1ccnc2[nH]c(CN3CCN(CC3)C3COC3)cc12)N1CCOc2cc(cc(F)c2C1=O)C1CC1
Show InChI InChI=1S/C34H35F2N5O4/c35-22-13-26(25-3-4-37-33-27(25)15-23(38-33)16-39-5-7-40(8-6-39)24-18-44-19-24)28(17-42)30(14-22)41-9-10-45-31-12-21(20-1-2-20)11-29(36)32(31)34(41)43/h3-4,11-15,20,24,42H,1-2,5-10,16-19H2,(H,37,38)
NCI pathway
Reactome pathway
US Patent
n/an/a 1.30n/an/an/an/an/an/a
ADVINUS THERAPEUTICS LIMITED
US Patent
Assay Description
The inhibition assays were performed using the generic tyrosine kinase assay kit from C is Bio (HTRF KinEASE-TK #62TK0PEB). The assay is based on t...
US Patent US9233983 (2016)
BindingDB Entry DOI: 10.7270/Q22J69PQ