BDBM202174 US9233983, K-22
SMILES: NC(=O)c1ccc(nc1)-c1cc2c(ccnc2[nH]1)-c1cccc(N2CCOc3cc(ccc3C2=O)C2CC2)c1CO
InChI Key: InChIKey=CMCLJSZVCBQUDH-UHFFFAOYSA-N
Data: 1 IC50
Activity Spreadsheet -- Enzyme Inhibition Constant Data from BindingDB
Found 1 hit for monomerid = 202174
Trg + Lig
Ki
nM
ΔG°
kcal/mole
IC50
nM
Kd
nM
EC50/IC50
nM
koff
s-1
kon
M-1s-1
pHTemp
°C
Tyrosine-protein kinase BTK
(Homo sapiens (Human))
BDBM202174
(US9233983, K-22)
Show SMILES NC(=O)c1ccc(nc1)-c1cc2c(ccnc2[nH]1)-c1cccc(N2CCOc3cc(ccc3C2=O)C2CC2)c1CO
Show InChI InChI=1S/C32H27N5O4/c33-30(39)20-7-9-26(35-16-20)27-15-24-22(10-11-34-31(24)36-27)21-2-1-3-28(25(21)17-38)37-12-13-41-29-14-19(18-4-5-18)6-8-23(29)32(37)40/h1-3,6-11,14-16,18,38H,4-5,12-13,17H2,(H2,33,39)(H,34,36)
NCI pathway
Reactome pathway
US Patent
n/an/a 2n/an/an/an/an/an/a
ADVINUS THERAPEUTICS LIMITED
US Patent
Assay Description
The inhibition assays were performed using the generic tyrosine kinase assay kit from C is Bio (HTRF KinEASE-TK #62TK0PEB). The assay is based on t...
US Patent US9233983 (2016)
BindingDB Entry DOI: 10.7270/Q22J69PQ