null
SMILES: CN(C)C(=O)N1CCC(=CC1)c1cc2c(ccnc2[nH]1)-c1cccc(N2CCOc3cc(ccc3C2=O)C2CC2)c1CO
InChI Key: InChIKey=LCCCCYKLSPXNSS-UHFFFAOYSA-N
Activity Spreadsheet -- Enzyme Inhibition Constant Data from BindingDB
Found 1 hit for monomerid = 202189
Trg + Lig
Ki
nM
ΔG°
kcal/mole
IC50
nM
Kd
nM
EC50/IC50
nM
koff
s-1
kon
M-1s-1
pHTemp
°C
Tyrosine-protein kinase BTK
(Homo sapiens (Human))
BDBM202189
(US9233983, P-5)
Show SMILES CN(C)C(=O)N1CCC(=CC1)c1cc2c(ccnc2[nH]1)-c1cccc(N2CCOc3cc(ccc3C2=O)C2CC2)c1CO |c:8|
Show InChI InChI=1S/C34H35N5O4/c1-37(2)34(42)38-14-11-22(12-15-38)29-19-27-25(10-13-35-32(27)36-29)24-4-3-5-30(28(24)20-40)39-16-17-43-31-18-23(21-6-7-21)8-9-26(31)33(39)41/h3-5,8-11,13,18-19,21,40H,6-7,12,14-17,20H2,1-2H3,(H,35,36)
NCI pathway
Reactome pathway
US Patent
n/an/a 2n/an/an/an/an/an/a
ADVINUS THERAPEUTICS LIMITED
US Patent
Assay Description
The inhibition assays were performed using the generic tyrosine kinase assay kit from C is Bio (HTRF KinEASE-TK #62TK0PEB). The assay is based on t...
US Patent US9233983 (2016)
BindingDB Entry DOI: 10.7270/Q22J69PQ