BDBM202364 US9238626, (-)-(Ib) HCl
SMILES: CC1=C[C@H]2C[C@@H](C1)c1c(C2)nc2cc(Cl)ccc2c1NCCCCCCCCCNC(=O)c1cc(O)c2C(=O)c3c(O)cccc3C(=O)c2c1
InChI Key: InChIKey=VZYCFKMNVCPCHV-SKCDSABHSA-N
Data: 4 IC50
Activity Spreadsheet -- Enzyme Inhibition Constant Data from BindingDB
Found 4 hits for monomerid = 202364
Trg + Lig
Ki
nM
ΔG°
kcal/mole
IC50
nM
Kd
nM
EC50/IC50
nM
koff
s-1
kon
M-1s-1
pHTemp
°C
Cholinesterase
(Homo sapiens (Human))
BDBM202364
(US9238626, (-)-(Ib) HCl)
Show SMILES CC1=C[C@H]2C[C@@H](C1)c1c(C2)nc2cc(Cl)ccc2c1NCCCCCCCCCNC(=O)c1cc(O)c2C(=O)c3c(O)cccc3C(=O)c2c1 |r,t:1|
Show InChI InChI=1S/C41H42ClN3O5/c1-23-16-24-18-25(17-23)35-32(19-24)45-31-22-27(42)12-13-28(31)38(35)43-14-7-5-3-2-4-6-8-15-44-41(50)26-20-30-37(34(47)21-26)40(49)36-29(39(30)48)10-9-11-33(36)46/h9-13,16,20-22,24-25,46-47H,2-8,14-15,17-19H2,1H3,(H,43,45)(H,44,50)/t24-,25?/m0/s1
Reactome pathway
US Patent
n/an/a 513n/an/an/an/a8.025
UNIVERSITAT DE BARCELONA; PONTIFICIA UNIVERSIDAD CATÓLICA DE CHILE
US Patent
Assay Description
BChE inhibitory activity determinations were carried out similarly by the method of Ellman et al., using 0.02 unit/mL of human serum BChE and 300 u...
US Patent US9238626 (2016)
BindingDB Entry DOI: 10.7270/Q2T152FZ
Acetylcholinesterase
(Homo sapiens (Human))
BDBM202364
(US9238626, (-)-(Ib) HCl)
Show SMILES CC1=C[C@H]2C[C@@H](C1)c1c(C2)nc2cc(Cl)ccc2c1NCCCCCCCCCNC(=O)c1cc(O)c2C(=O)c3c(O)cccc3C(=O)c2c1 |r,t:1|
Show InChI InChI=1S/C41H42ClN3O5/c1-23-16-24-18-25(17-23)35-32(19-24)45-31-22-27(42)12-13-28(31)38(35)43-14-7-5-3-2-4-6-8-15-44-41(50)26-20-30-37(34(47)21-26)40(49)36-29(39(30)48)10-9-11-33(36)46/h9-13,16,20-22,24-25,46-47H,2-8,14-15,17-19H2,1H3,(H,43,45)(H,44,50)/t24-,25?/m0/s1
NCI pathway
Reactome pathway
US Patent
n/an/a 2.40n/an/an/an/a8.025
UNIVERSITAT DE BARCELONA; PONTIFICIA UNIVERSIDAD CATÓLICA DE CHILE
US Patent
Assay Description
AChE inhibitory activity of compounds (Ia)-(Ie) and (-)-(Ib) and (+)-(Ib) was evaluated spectrophotometrically at 25° C. by the method of Ellma...
US Patent US9238626 (2016)
BindingDB Entry DOI: 10.7270/Q2T152FZ
Acetylcholinesterase
(Electrophorus electricus (Electric eel))
BDBM202364
(US9238626, (-)-(Ib) HCl)
Show SMILES CC1=C[C@H]2C[C@@H](C1)c1c(C2)nc2cc(Cl)ccc2c1NCCCCCCCCCNC(=O)c1cc(O)c2C(=O)c3c(O)cccc3C(=O)c2c1 |r,t:1|
Show InChI InChI=1S/C41H42ClN3O5/c1-23-16-24-18-25(17-23)35-32(19-24)45-31-22-27(42)12-13-28(31)38(35)43-14-7-5-3-2-4-6-8-15-44-41(50)26-20-30-37(34(47)21-26)40(49)36-29(39(30)48)10-9-11-33(36)46/h9-13,16,20-22,24-25,46-47H,2-8,14-15,17-19H2,1H3,(H,43,45)(H,44,50)/t24-,25?/m0/s1
US Patent
n/an/a 9.40n/an/an/an/a8.025
UNIVERSITAT DE BARCELONA; PONTIFICIA UNIVERSIDAD CATÓLICA DE CHILE
US Patent
Assay Description
AChE inhibitory activity of compounds (Ia)-(Ie) and (-)-(Ib) and (+)-(Ib) was evaluated spectrophotometrically at 25° C. by the method of Ellma...
US Patent US9238626 (2016)
BindingDB Entry DOI: 10.7270/Q2T152FZ
Beta-secretase 1
(Homo sapiens (Human))
BDBM202364
(US9238626, (-)-(Ib) HCl)
Show SMILES CC1=C[C@H]2C[C@@H](C1)c1c(C2)nc2cc(Cl)ccc2c1NCCCCCCCCCNC(=O)c1cc(O)c2C(=O)c3c(O)cccc3C(=O)c2c1 |r,t:1|
Show InChI InChI=1S/C41H42ClN3O5/c1-23-16-24-18-25(17-23)35-32(19-24)45-31-22-27(42)12-13-28(31)38(35)43-14-7-5-3-2-4-6-8-15-44-41(50)26-20-30-37(34(47)21-26)40(49)36-29(39(30)48)10-9-11-33(36)46/h9-13,16,20-22,24-25,46-47H,2-8,14-15,17-19H2,1H3,(H,43,45)(H,44,50)/t24-,25?/m0/s1
US Patent
n/an/a 80n/an/an/an/an/a25
UNIVERSITAT DE BARCELONA; PONTIFICIA UNIVERSIDAD CATÓLICA DE CHILE
US Patent
Assay Description
β-Secretase (BACE-1, Sigma) inhibition studies were performed by employing a peptide mimicking APP sequence as substrate (methoxycoumarin-Ser-...
US Patent US9238626 (2016)
BindingDB Entry DOI: 10.7270/Q2T152FZ