null
SMILES: COCCn1cc(Nc2ncc(Cl)c(CCc3ccccc3C3(CC3)C(N)=O)n2)cn1
InChI Key: InChIKey=JYBKSCNJALGPEP-UHFFFAOYSA-N
Activity Spreadsheet -- Enzyme Inhibition Constant Data from BindingDB
Found 1 hit for monomerid = 202476
Trg + Lig
Ki
nM
ΔG°
kcal/mole
IC50
nM
Kd
nM
EC50/IC50
nM
koff
s-1
kon
M-1s-1
pHTemp
°C
Vascular endothelial growth factor receptor 3
(Homo sapiens (Human))
BDBM202476
(US9238644, 77)
Show SMILES COCCn1cc(Nc2ncc(Cl)c(CCc3ccccc3C3(CC3)C(N)=O)n2)cn1
Show InChI InChI=1S/C22H25ClN6O2/c1-31-11-10-29-14-16(12-26-29)27-21-25-13-18(23)19(28-21)7-6-15-4-2-3-5-17(15)22(8-9-22)20(24)30/h2-5,12-14H,6-11H2,1H3,(H2,24,30)(H,25,27,28)
US Patent
n/an/a 3n/an/an/an/a7.4n/a
CANCER THERAPEUTICS CRC PTY LIMITED
US Patent
Assay Description
A biotin labelled peptide is used as substrate (amino acid sequence: Biotin-Glu-Gly-Pro-Trp-Leu-Glu-Glu-Glu-Glu-Glu-Ala-Tyr-Gly-Trp-Met-Asp-Phe-NH2)....
US Patent US9238644 (2016)
BindingDB Entry DOI: 10.7270/Q2JM28FP