BDBM202665 US10245267, Example 10::US10709712, Example 10::US9242969, 10::US9694016, 10
SMILES: Cc1ccc(NC(=O)c2cccc(c2)C(F)(F)F)cc1-c1cc(nc(n1)N1CCOCC1)N1CCOCC1
InChI Key: InChIKey=ZHNCJARBTUXWNB-UHFFFAOYSA-N
Data: 18 IC50
Activity Spreadsheet -- Enzyme Inhibition Constant Data from BindingDB
Found 18 hits for monomerid = 202665
Trg + Lig
Ki
nM
ΔG°
kcal/mole
IC50
nM
Kd
nM
EC50/IC50
nM
koff
s-1
kon
M-1s-1
pHTemp
°C
Serine/threonine-protein kinase B-raf
(Homo sapiens (Human))
BDBM202665
(US10245267, Example 10 | US10709712, Example 10 | ...)
Show SMILES Cc1ccc(NC(=O)c2cccc(c2)C(F)(F)F)cc1-c1cc(nc(n1)N1CCOCC1)N1CCOCC1
Show InChI InChI=1S/C27H28F3N5O3/c1-18-5-6-21(31-25(36)19-3-2-4-20(15-19)27(28,29)30)16-22(18)23-17-24(34-7-11-37-12-8-34)33-26(32-23)35-9-13-38-14-10-35/h2-6,15-17H,7-14H2,1H3,(H,31,36)
NCI pathway
Reactome pathway
US Patent
n/an/a 0.330n/an/an/an/a7.525
Novartis AG
US Patent
Assay Description
Final assay conditions were 4 pM cRaf, 3 uM ATP, 10 nM biotin tagged MEK1 kinase dead protein substrate. Reactions were performed in Greiner384 well ...
US Patent US9242969 (2016)
BindingDB Entry DOI: 10.7270/Q2VT1QXT
RAF proto-oncogene serine/threonine-protein kinase
(Homo sapiens (Human))
BDBM202665
(US10245267, Example 10 | US10709712, Example 10 | ...)
Show SMILES Cc1ccc(NC(=O)c2cccc(c2)C(F)(F)F)cc1-c1cc(nc(n1)N1CCOCC1)N1CCOCC1
Show InChI InChI=1S/C27H28F3N5O3/c1-18-5-6-21(31-25(36)19-3-2-4-20(15-19)27(28,29)30)16-22(18)23-17-24(34-7-11-37-12-8-34)33-26(32-23)35-9-13-38-14-10-35/h2-6,15-17H,7-14H2,1H3,(H,31,36)
NCI pathway
Reactome pathway
US Patent
n/an/a 0.5n/an/an/an/an/an/a
NOVARTIS AG
US Patent
Assay Description
C-Raf TR refers to a truncated C-Raf protein, a Δ1-324 deletion mutant.C-Raf FL refers to the full-length C-Raf protein.Full length MEK1 with an...
US Patent US10709712 (2020)
C-Raf TR (aa 1-324)
(Homo sapiens (Human))
BDBM202665
(US10245267, Example 10 | US10709712, Example 10 | ...)
Show SMILES Cc1ccc(NC(=O)c2cccc(c2)C(F)(F)F)cc1-c1cc(nc(n1)N1CCOCC1)N1CCOCC1
Show InChI InChI=1S/C27H28F3N5O3/c1-18-5-6-21(31-25(36)19-3-2-4-20(15-19)27(28,29)30)16-22(18)23-17-24(34-7-11-37-12-8-34)33-26(32-23)35-9-13-38-14-10-35/h2-6,15-17H,7-14H2,1H3,(H,31,36)
US Patent
n/an/a 0.118n/an/an/an/a7.525
Novartis AG
US Patent
Assay Description
Final assay conditions were 4 pM cRaf, 3 uM ATP, 10 nM biotin tagged MEK1 kinase dead protein substrate. Reactions were performed in Greiner384 well ...
US Patent US9242969 (2016)
BindingDB Entry DOI: 10.7270/Q2VT1QXT
B-RAF V600E
(Homo sapiens (Human))
BDBM202665
(US10245267, Example 10 | US10709712, Example 10 | ...)
Show SMILES Cc1ccc(NC(=O)c2cccc(c2)C(F)(F)F)cc1-c1cc(nc(n1)N1CCOCC1)N1CCOCC1
Show InChI InChI=1S/C27H28F3N5O3/c1-18-5-6-21(31-25(36)19-3-2-4-20(15-19)27(28,29)30)16-22(18)23-17-24(34-7-11-37-12-8-34)33-26(32-23)35-9-13-38-14-10-35/h2-6,15-17H,7-14H2,1H3,(H,31,36)
US Patent
n/an/a 0.330n/an/an/an/a7.525
NOVARTIS AG
US Patent
Assay Description
Raf and biotinylated Mek, kinase dead, were combined at 2x final concentrations in assay buffer (50 mM Tris, pH 7.5, 15 mM MgCl2, 0.01% BSA and 1 mM ...
US Patent US9694016 (2017)
BindingDB Entry DOI: 10.7270/Q2MC8X6W
C-RAF
(Homo sapiens (Human))
BDBM202665
(US10245267, Example 10 | US10709712, Example 10 | ...)
Show SMILES Cc1ccc(NC(=O)c2cccc(c2)C(F)(F)F)cc1-c1cc(nc(n1)N1CCOCC1)N1CCOCC1
Show InChI InChI=1S/C27H28F3N5O3/c1-18-5-6-21(31-25(36)19-3-2-4-20(15-19)27(28,29)30)16-22(18)23-17-24(34-7-11-37-12-8-34)33-26(32-23)35-9-13-38-14-10-35/h2-6,15-17H,7-14H2,1H3,(H,31,36)
US Patent
n/an/a 0.100n/an/an/an/a7.525
NOVARTIS AG
US Patent
Assay Description
Raf and biotinylated Mek, kinase dead, were combined at 2x final concentrations in assay buffer (50 mM Tris, pH 7.5, 15 mM MgCl2, 0.01% BSA and 1 mM ...
US Patent US9694016 (2017)
BindingDB Entry DOI: 10.7270/Q2MC8X6W
C-Raf TR (aa 1-324)
(Homo sapiens (Human))
BDBM202665
(US10245267, Example 10 | US10709712, Example 10 | ...)
Show SMILES Cc1ccc(NC(=O)c2cccc(c2)C(F)(F)F)cc1-c1cc(nc(n1)N1CCOCC1)N1CCOCC1
Show InChI InChI=1S/C27H28F3N5O3/c1-18-5-6-21(31-25(36)19-3-2-4-20(15-19)27(28,29)30)16-22(18)23-17-24(34-7-11-37-12-8-34)33-26(32-23)35-9-13-38-14-10-35/h2-6,15-17H,7-14H2,1H3,(H,31,36)
US Patent
n/an/a 0.120n/an/an/an/a7.525
NOVARTIS AG
US Patent
Assay Description
Raf and biotinylated Mek, kinase dead, were combined at 2x final concentrations in assay buffer (50 mM Tris, pH 7.5, 15 mM MgCl2, 0.01% BSA and 1 mM ...
US Patent US9694016 (2017)
BindingDB Entry DOI: 10.7270/Q2MC8X6W
B-RAF V600E
(Homo sapiens (Human))
BDBM202665
(US10245267, Example 10 | US10709712, Example 10 | ...)
Show SMILES Cc1ccc(NC(=O)c2cccc(c2)C(F)(F)F)cc1-c1cc(nc(n1)N1CCOCC1)N1CCOCC1
Show InChI InChI=1S/C27H28F3N5O3/c1-18-5-6-21(31-25(36)19-3-2-4-20(15-19)27(28,29)30)16-22(18)23-17-24(34-7-11-37-12-8-34)33-26(32-23)35-9-13-38-14-10-35/h2-6,15-17H,7-14H2,1H3,(H,31,36)
US Patent
n/an/a 0.300n/an/an/an/a7.525
NOVARTIS AG
US Patent
Assay Description
Raf and biotinylated Mek, kinase dead, were combined at 2x final concentrations in assay buffer (50 mM Tris, pH 7.5, 15 mM MgCl2, 0.01% BSA and 1 mM ...
US Patent US9694016 (2017)
BindingDB Entry DOI: 10.7270/Q2MC8X6W
C-RAF
(Homo sapiens (Human))
BDBM202665
(US10245267, Example 10 | US10709712, Example 10 | ...)
Show SMILES Cc1ccc(NC(=O)c2cccc(c2)C(F)(F)F)cc1-c1cc(nc(n1)N1CCOCC1)N1CCOCC1
Show InChI InChI=1S/C27H28F3N5O3/c1-18-5-6-21(31-25(36)19-3-2-4-20(15-19)27(28,29)30)16-22(18)23-17-24(34-7-11-37-12-8-34)33-26(32-23)35-9-13-38-14-10-35/h2-6,15-17H,7-14H2,1H3,(H,31,36)
US Patent
n/an/a 0.5n/an/an/an/a7.525
NOVARTIS AG
US Patent
Assay Description
Raf and biotinylated Mek, kinase dead, were combined at 2x final concentrations in assay buffer (50 mM Tris, pH 7.5, 15 mM MgCl2, 0.01% BSA and 1 mM ...
US Patent US9694016 (2017)
BindingDB Entry DOI: 10.7270/Q2MC8X6W
B-RAF V600E
(Homo sapiens (Human))
BDBM202665
(US10245267, Example 10 | US10709712, Example 10 | ...)
Show SMILES Cc1ccc(NC(=O)c2cccc(c2)C(F)(F)F)cc1-c1cc(nc(n1)N1CCOCC1)N1CCOCC1
Show InChI InChI=1S/C27H28F3N5O3/c1-18-5-6-21(31-25(36)19-3-2-4-20(15-19)27(28,29)30)16-22(18)23-17-24(34-7-11-37-12-8-34)33-26(32-23)35-9-13-38-14-10-35/h2-6,15-17H,7-14H2,1H3,(H,31,36)
US Patent
n/an/a 0.330n/an/an/an/an/an/a
Bristol-Myers Squibb Company
Assay Description
Raf and biotinylated Mek, kinase dead, were combined at 2× final concentrations in assay buffer (50 mM Tris, pH 7.5, 15 mM MgCl2, 0.01% BSA and 1 mM ...
Bioorg Med Chem Lett 17: 5115-20 (2007)
BindingDB Entry DOI: 10.7270/Q2RB76WP
RAF proto-oncogene serine/threonine-protein kinase
(Homo sapiens (Human))
BDBM202665
(US10245267, Example 10 | US10709712, Example 10 | ...)
Show SMILES Cc1ccc(NC(=O)c2cccc(c2)C(F)(F)F)cc1-c1cc(nc(n1)N1CCOCC1)N1CCOCC1
Show InChI InChI=1S/C27H28F3N5O3/c1-18-5-6-21(31-25(36)19-3-2-4-20(15-19)27(28,29)30)16-22(18)23-17-24(34-7-11-37-12-8-34)33-26(32-23)35-9-13-38-14-10-35/h2-6,15-17H,7-14H2,1H3,(H,31,36)
NCI pathway
Reactome pathway
US Patent
n/an/a 0.103n/an/an/an/an/an/a
Bristol-Myers Squibb Company
Assay Description
Raf and biotinylated Mek, kinase dead, were combined at 2× final concentrations in assay buffer (50 mM Tris, pH 7.5, 15 mM MgCl2, 0.01% BSA and 1 mM ...
Bioorg Med Chem Lett 17: 5115-20 (2007)
BindingDB Entry DOI: 10.7270/Q2RB76WP
RAF proto-oncogene serine/threonine-protein kinase (aa 1-324)
(Homo sapiens (Human))
BDBM202665
(US10245267, Example 10 | US10709712, Example 10 | ...)
Show SMILES Cc1ccc(NC(=O)c2cccc(c2)C(F)(F)F)cc1-c1cc(nc(n1)N1CCOCC1)N1CCOCC1
Show InChI InChI=1S/C27H28F3N5O3/c1-18-5-6-21(31-25(36)19-3-2-4-20(15-19)27(28,29)30)16-22(18)23-17-24(34-7-11-37-12-8-34)33-26(32-23)35-9-13-38-14-10-35/h2-6,15-17H,7-14H2,1H3,(H,31,36)
US Patent
n/an/a 0.118n/an/an/an/an/an/a
Bristol-Myers Squibb Company
Assay Description
Raf and biotinylated Mek, kinase dead, were combined at 2× final concentrations in assay buffer (50 mM Tris, pH 7.5, 15 mM MgCl2, 0.01% BSA and 1 mM ...
Bioorg Med Chem Lett 17: 5115-20 (2007)
BindingDB Entry DOI: 10.7270/Q2RB76WP
B-RAF V600E
(Homo sapiens (Human))
BDBM202665
(US10245267, Example 10 | US10709712, Example 10 | ...)
Show SMILES Cc1ccc(NC(=O)c2cccc(c2)C(F)(F)F)cc1-c1cc(nc(n1)N1CCOCC1)N1CCOCC1
Show InChI InChI=1S/C27H28F3N5O3/c1-18-5-6-21(31-25(36)19-3-2-4-20(15-19)27(28,29)30)16-22(18)23-17-24(34-7-11-37-12-8-34)33-26(32-23)35-9-13-38-14-10-35/h2-6,15-17H,7-14H2,1H3,(H,31,36)
US Patent
n/an/a 0.300n/an/an/an/an/an/a
Bristol-Myers Squibb Company
Assay Description
Raf and biotinylated Mek, kinase dead, were combined at 2× final concentrations in assay buffer (50 mM Tris, pH 7.5, 15 mM MgCl2, 0.01% BSA and 1 mM ...
Bioorg Med Chem Lett 17: 5115-20 (2007)
BindingDB Entry DOI: 10.7270/Q2RB76WP
RAF proto-oncogene serine/threonine-protein kinase
(Homo sapiens (Human))
BDBM202665
(US10245267, Example 10 | US10709712, Example 10 | ...)
Show SMILES Cc1ccc(NC(=O)c2cccc(c2)C(F)(F)F)cc1-c1cc(nc(n1)N1CCOCC1)N1CCOCC1
Show InChI InChI=1S/C27H28F3N5O3/c1-18-5-6-21(31-25(36)19-3-2-4-20(15-19)27(28,29)30)16-22(18)23-17-24(34-7-11-37-12-8-34)33-26(32-23)35-9-13-38-14-10-35/h2-6,15-17H,7-14H2,1H3,(H,31,36)
NCI pathway
Reactome pathway
US Patent
n/an/a 0.5n/an/an/an/an/an/a
Bristol-Myers Squibb Company
Assay Description
Raf and biotinylated Mek, kinase dead, were combined at 2× final concentrations in assay buffer (50 mM Tris, pH 7.5, 15 mM MgCl2, 0.01% BSA and 1 mM ...
Bioorg Med Chem Lett 17: 5115-20 (2007)
BindingDB Entry DOI: 10.7270/Q2RB76WP
B-RAF V600E
(Homo sapiens (Human))
BDBM202665
(US10245267, Example 10 | US10709712, Example 10 | ...)
Show SMILES Cc1ccc(NC(=O)c2cccc(c2)C(F)(F)F)cc1-c1cc(nc(n1)N1CCOCC1)N1CCOCC1
Show InChI InChI=1S/C27H28F3N5O3/c1-18-5-6-21(31-25(36)19-3-2-4-20(15-19)27(28,29)30)16-22(18)23-17-24(34-7-11-37-12-8-34)33-26(32-23)35-9-13-38-14-10-35/h2-6,15-17H,7-14H2,1H3,(H,31,36)
US Patent
n/an/a 0.330n/an/an/an/an/an/a
NOVARTIS AG
US Patent
Assay Description
C-Raf TR refers to a truncated C-Raf protein, a Δ1-324 deletion mutant.C-Raf FL refers to the full-length C-Raf protein.Full length MEK1 with an...
US Patent US10709712 (2020)
RAF proto-oncogene serine/threonine-protein kinase
(Homo sapiens (Human))
BDBM202665
(US10245267, Example 10 | US10709712, Example 10 | ...)
Show SMILES Cc1ccc(NC(=O)c2cccc(c2)C(F)(F)F)cc1-c1cc(nc(n1)N1CCOCC1)N1CCOCC1
Show InChI InChI=1S/C27H28F3N5O3/c1-18-5-6-21(31-25(36)19-3-2-4-20(15-19)27(28,29)30)16-22(18)23-17-24(34-7-11-37-12-8-34)33-26(32-23)35-9-13-38-14-10-35/h2-6,15-17H,7-14H2,1H3,(H,31,36)
NCI pathway
Reactome pathway
US Patent
n/an/a 0.103n/an/an/an/an/an/a
NOVARTIS AG
US Patent
Assay Description
C-Raf TR refers to a truncated C-Raf protein, a Δ1-324 deletion mutant.C-Raf FL refers to the full-length C-Raf protein.Full length MEK1 with an...
US Patent US10709712 (2020)
RAF proto-oncogene serine/threonine-protein kinase (truncated)(325-648)
(Homo sapiens (Human))
BDBM202665
(US10245267, Example 10 | US10709712, Example 10 | ...)
Show SMILES Cc1ccc(NC(=O)c2cccc(c2)C(F)(F)F)cc1-c1cc(nc(n1)N1CCOCC1)N1CCOCC1
Show InChI InChI=1S/C27H28F3N5O3/c1-18-5-6-21(31-25(36)19-3-2-4-20(15-19)27(28,29)30)16-22(18)23-17-24(34-7-11-37-12-8-34)33-26(32-23)35-9-13-38-14-10-35/h2-6,15-17H,7-14H2,1H3,(H,31,36)
US Patent
n/an/a 0.118n/an/an/an/an/an/a
NOVARTIS AG
US Patent
Assay Description
C-Raf TR refers to a truncated C-Raf protein, a Δ1-324 deletion mutant.C-Raf FL refers to the full-length C-Raf protein.Full length MEK1 with an...
US Patent US10709712 (2020)
B-RAF V600E
(Homo sapiens (Human))
BDBM202665
(US10245267, Example 10 | US10709712, Example 10 | ...)
Show SMILES Cc1ccc(NC(=O)c2cccc(c2)C(F)(F)F)cc1-c1cc(nc(n1)N1CCOCC1)N1CCOCC1
Show InChI InChI=1S/C27H28F3N5O3/c1-18-5-6-21(31-25(36)19-3-2-4-20(15-19)27(28,29)30)16-22(18)23-17-24(34-7-11-37-12-8-34)33-26(32-23)35-9-13-38-14-10-35/h2-6,15-17H,7-14H2,1H3,(H,31,36)
US Patent
n/an/a 0.300n/an/an/an/an/an/a
NOVARTIS AG
US Patent
Assay Description
C-Raf TR refers to a truncated C-Raf protein, a Δ1-324 deletion mutant.C-Raf FL refers to the full-length C-Raf protein.Full length MEK1 with an...
US Patent US10709712 (2020)
C-RAF
(Homo sapiens (Human))
BDBM202665
(US10245267, Example 10 | US10709712, Example 10 | ...)
Show SMILES Cc1ccc(NC(=O)c2cccc(c2)C(F)(F)F)cc1-c1cc(nc(n1)N1CCOCC1)N1CCOCC1
Show InChI InChI=1S/C27H28F3N5O3/c1-18-5-6-21(31-25(36)19-3-2-4-20(15-19)27(28,29)30)16-22(18)23-17-24(34-7-11-37-12-8-34)33-26(32-23)35-9-13-38-14-10-35/h2-6,15-17H,7-14H2,1H3,(H,31,36)
US Patent
n/an/a 0.103n/an/an/an/a7.525
Novartis AG
US Patent
Assay Description
Final assay conditions were 4 pM cRaf, 3 uM ATP, 10 nM biotin tagged MEK1 kinase dead protein substrate. Reactions were performed in Greiner384 well ...
US Patent US9242969 (2016)
BindingDB Entry DOI: 10.7270/Q2VT1QXT