BDBM2027 2,8-disubstituted dipyridodiazepinone 7::2-Chloro-5,11-dihydro-11-ethyl-5-methyl-8-(N-methylphenylamino)methyl-6H-dipyrido[3,2-b:2 ,3 -e][1,4]diazepin-6-one::5-chloro-2-ethyl-9-methyl-13-{[methyl(phenyl)amino]methyl}-2,4,9,15-tetraazatricyclo[9.4.0.0^{3,8}]pentadeca-1(11),3,5,7,12,14-hexaen-10-one
SMILES: CCN1c2nc(Cl)ccc2N(C)C(=O)c2cc(CN(C)c3ccccc3)cnc12
InChI Key: InChIKey=LXYRIXWPXWAGJA-UHFFFAOYSA-N
Data: 2 IC50
Activity Spreadsheet -- Enzyme Inhibition Constant Data from BindingDB
Found 2 hits for monomerid = 2027
Trg + Lig
Ki
nM
ΔG°
kcal/mole
IC50
nM
Kd
nM
EC50/IC50
nM
koff
s-1
kon
M-1s-1
pHTemp
°C
Human immunodeficiency virus type 1 reverse transcriptase
(Human immunodeficiency virus 1)
BDBM2027
(2,8-disubstituted dipyridodiazepinone 7 | 2-Chloro...)
Show SMILES CCN1c2nc(Cl)ccc2N(C)C(=O)c2cc(CN(C)c3ccccc3)cnc12
Show InChI InChI=1S/C22H22ClN5O/c1-4-28-20-17(22(29)27(3)18-10-11-19(23)25-21(18)28)12-15(13-24-20)14-26(2)16-8-6-5-7-9-16/h5-13H,4,14H2,1-3H3
n/an/a 590n/an/an/an/an/an/a
Boehringer Ingelheim Pharmaceuticals Inc.
Assay Description
Inhibitory activity against HIV-1 wild-type reverse transcriptase.
J Med Chem 41: 2972-84 (1998)
Article DOI: 10.1021/jm9707030
BindingDB Entry DOI: 10.7270/Q2J964K7
HIV-1 Reverse Transcriptase
(Human immunodeficiency virus type 1)
BDBM2027
(2,8-disubstituted dipyridodiazepinone 7 | 2-Chloro...)
Show SMILES CCN1c2nc(Cl)ccc2N(C)C(=O)c2cc(CN(C)c3ccccc3)cnc12
Show InChI InChI=1S/C22H22ClN5O/c1-4-28-20-17(22(29)27(3)18-10-11-19(23)25-21(18)28)12-15(13-24-20)14-26(2)16-8-6-5-7-9-16/h5-13H,4,14H2,1-3H3
n/an/a 590n/an/an/an/a7.822
Boehringer Ingelheim Pharmaceuticals Inc.
Assay Description
The IC50 of reverse transcriptase is the concentration that inhibits 50% of recombinant HIV-1 RT RNA-directed DNA polymerase activity in vitro.
J Med Chem 41: 2972-84 (1998)
Article DOI: 10.1021/jm9707030
BindingDB Entry DOI: 10.7270/Q2J964K7