null
SMILES: COc1cc(ccc1NS(C)(=O)=O)C(C)C(=O)NCC(COC(=O)C(C)(C)C)Cc1ccc(cc1)C(C)(C)C
InChI Key: InChIKey=ITXHLTBQNZPKSS-UHFFFAOYSA-N
Activity Spreadsheet -- Enzyme Inhibition Constant Data from BindingDB
Found 1 hit for monomerid = 20292
Trg + Lig
Ki
nM
ΔG°
kcal/mole
IC50
nM
Kd
nM
EC50/IC50
nM
koff
s-1
kon
M-1s-1
pHTemp
°C
Transient receptor potential cation channel subfamily V member 1
(Rattus norvegicus (rat))
BDBM20292
(2-[(4-tert-butylphenyl)methyl]-3-[2-(4-methanesulf...)
Show SMILES COc1cc(ccc1NS(C)(=O)=O)C(C)C(=O)NCC(COC(=O)C(C)(C)C)Cc1ccc(cc1)C(C)(C)C
Show InChI InChI=1S/C30H44N2O6S/c1-20(23-12-15-25(26(17-23)37-8)32-39(9,35)36)27(33)31-18-22(19-38-28(34)30(5,6)7)16-21-10-13-24(14-11-21)29(2,3)4/h10-15,17,20,22,32H,16,18-19H2,1-9H3,(H,31,33)
Reactome pathway
24 -10.8n/an/an/an/an/a7.437
Seoul National University
Assay Description
Binding assay mixtures were set up and contained [3H] RTX, various concentrations of competing ligands, and rVR1-transfected CHO cells. Nonspecific b...
J Med Chem 51: 57-67 (2008)
Article DOI: 10.1021/jm701049p
BindingDB Entry DOI: 10.7270/Q2222S1N