BDBM20294 2-[(3,4-dimethylphenyl)methyl]-3-[1-(3-fluoro-4-methanesulfonamidophenyl)acetamido]propyl 2,2-dimethylpropanoate::CHEMBL73418::amide analogue, 4
SMILES: Cc1ccc(CC(CNC(=O)Cc2ccc(NS(C)(=O)=O)c(F)c2)COC(=O)C(C)(C)C)cc1C
InChI Key: InChIKey=RMOKHHQCLRLRLE-UHFFFAOYSA-N
Data: 2 KI  1 IC50  1 EC50
Activity Spreadsheet -- Enzyme Inhibition Constant Data from BindingDB
Found 3 hits for monomerid = 20294
Trg + Lig
Ki
nM
ΔG°
kcal/mole
IC50
nM
Kd
nM
EC50/IC50
nM
koff
s-1
kon
M-1s-1
pHTemp
°C
Vanilloid receptor
(Rattus norvegicus (rat))
BDBM20294
(2-[(3,4-dimethylphenyl)methyl]-3-[1-(3-fluoro-4-me...)
Show SMILES Cc1ccc(CC(CNC(=O)Cc2ccc(NS(C)(=O)=O)c(F)c2)COC(=O)C(C)(C)C)cc1C
Show InChI InChI=1S/C26H35FN2O5S/c1-17-7-8-19(11-18(17)2)12-21(16-34-25(31)26(3,4)5)15-28-24(30)14-20-9-10-23(22(27)13-20)29-35(6,32)33/h7-11,13,21,29H,12,14-16H2,1-6H3,(H,28,30)
Reactome pathway
157 -9.65n/an/a 151n/an/a7.437
Seoul National University
Assay Description
Binding assay mixtures were set up and contained [3H] RTX, various concentrations of competing ligands, and rVR1-transfected CHO cells. Nonspecific b...
J Med Chem 51: 57-67 (2008)
Article DOI: 10.1021/jm701049p
BindingDB Entry DOI: 10.7270/Q2222S1N
Vanilloid receptor
(Rattus norvegicus (rat))
BDBM20294
(2-[(3,4-dimethylphenyl)methyl]-3-[1-(3-fluoro-4-me...)
Show SMILES Cc1ccc(CC(CNC(=O)Cc2ccc(NS(C)(=O)=O)c(F)c2)COC(=O)C(C)(C)C)cc1C
Show InChI InChI=1S/C26H35FN2O5S/c1-17-7-8-19(11-18(17)2)12-21(16-34-25(31)26(3,4)5)15-28-24(30)14-20-9-10-23(22(27)13-20)29-35(6,32)33/h7-11,13,21,29H,12,14-16H2,1-6H3,(H,28,30)
Reactome pathway
157n/an/an/an/an/an/an/an/a
Seoul National University
Curated by ChEMBL
Assay Description
Binding affinity towards rat vanilloid receptor subtype 1 expressed in CHO cells by [3H]-RTX displacement.
Bioorg Med Chem Lett 14: 2291-7 (2004)
Article DOI: 10.1016/j.bmcl.2004.02.002
BindingDB Entry DOI: 10.7270/Q2TT4QCG
Vanilloid receptor
(Rattus norvegicus (rat))
BDBM20294
(2-[(3,4-dimethylphenyl)methyl]-3-[1-(3-fluoro-4-me...)
Show SMILES Cc1ccc(CC(CNC(=O)Cc2ccc(NS(C)(=O)=O)c(F)c2)COC(=O)C(C)(C)C)cc1C
Show InChI InChI=1S/C26H35FN2O5S/c1-17-7-8-19(11-18(17)2)12-21(16-34-25(31)26(3,4)5)15-28-24(30)14-20-9-10-23(22(27)13-20)29-35(6,32)33/h7-11,13,21,29H,12,14-16H2,1-6H3,(H,28,30)
Reactome pathway
n/an/a 150n/an/an/an/an/an/a
Seoul National University
Curated by ChEMBL
Assay Description
In vitro antagonist effect against 50 nM capsaicin-induced 45 [Ca2+] influx in vanilloid recptor expressing CHO cells
Bioorg Med Chem Lett 14: 2291-7 (2004)
Article DOI: 10.1016/j.bmcl.2004.02.002
BindingDB Entry DOI: 10.7270/Q2TT4QCG