BDBM20317 3-[(4-tert-butylphenyl)methyl]-1-[(1R)-1-(4-methanesulfonamidophenyl)ethyl]thiourea::thiourea analogue, 14
SMILES: C[C@@H](NC(=S)NCc1ccc(cc1)C(C)(C)C)c1ccc(NS(C)(=O)=O)cc1
InChI Key: InChIKey=MRGDOZGZFFCDRJ-OAHLLOKOSA-N
Data: 1 KI  1 EC50
Activity Spreadsheet -- Enzyme Inhibition Constant Data from BindingDB
Found 1 hit for monomerid = 20317
Trg + Lig
Ki
nM
ΔG°
kcal/mole
IC50
nM
Kd
nM
EC50/IC50
nM
koff
s-1
kon
M-1s-1
pHTemp
°C
Vanilloid receptor
(Rattus norvegicus (rat))
BDBM20317
(3-[(4-tert-butylphenyl)methyl]-1-[(1R)-1-(4-methan...)
Show SMILES C[C@@H](NC(=S)NCc1ccc(cc1)C(C)(C)C)c1ccc(NS(C)(=O)=O)cc1 |r|
Show InChI InChI=1S/C21H29N3O2S2/c1-15(17-8-12-19(13-9-17)24-28(5,25)26)23-20(27)22-14-16-6-10-18(11-7-16)21(2,3)4/h6-13,15,24H,14H2,1-5H3,(H2,22,23,27)/t15-/m1/s1
Reactome pathway
41 -10.5n/an/a 4.5n/an/a7.437
Seoul National University
Assay Description
Binding assay mixtures were set up and contained [3H] RTX, various concentrations of competing ligands, and rVR1-transfected CHO cells. Nonspecific b...
Bioorg Med Chem 15: 6043-53 (2007)
Article DOI: 10.1016/j.bmc.2007.06.041
BindingDB Entry DOI: 10.7270/Q2X928KS