BDBM203328 US9242981, 60
SMILES: Cn1cc(CN2CCC[C@H](C2)NC(=O)N2CCc3[nH]nc(c3C2)-c2ccncc2)c2ccccc12
InChI Key:
Data: 1 IC50  1 Kd
Activity Spreadsheet -- Enzyme Inhibition Constant Data from BindingDB
Found 2 hits for monomerid = 203328
Trg + Lig
Ki
nM
ΔG°
kcal/mole
IC50
nM
Kd
nM
EC50/IC50
nM
koff
s-1
kon
M-1s-1
pHTemp
°C
Mitogen-activated protein kinase 1
(Mus musculus (Mouse))
BDBM203328
(US9242981, 60)
Show SMILES Cn1cc(CN2CCC[C@H](C2)NC(=O)N2CCc3[nH]nc(c3C2)-c2ccncc2)c2ccccc12 |r|
Reactome pathway
US Patent
n/an/a 1.24n/an/an/an/an/an/a
Merck Sharp & Dohme Corp.
US Patent
Assay Description
Activated ERK2 activity was also determined in the IMAP assay format using the procedure outlined above. 1 μl of 25× compound was added to 14 &#...
US Patent US9242981 (2016)
BindingDB Entry DOI: 10.7270/Q2GM864G
Mitogen-activated protein kinase 1
(Mus musculus (Mouse))
BDBM203328
(US9242981, 60)
Show SMILES Cn1cc(CN2CCC[C@H](C2)NC(=O)N2CCc3[nH]nc(c3C2)-c2ccncc2)c2ccccc12 |r|
Reactome pathway
US Patent
n/an/an/a 1.12n/an/an/an/a30
Merck Sharp & Dohme Corp.
US Patent
Assay Description
The SAR (Structure Activity Relationship) for ERK ligands covered by this invention was interrogated using the TdF (Temperature Dependence Fluoresc...
US Patent US9242981 (2016)
BindingDB Entry DOI: 10.7270/Q2GM864G