BDBM203660 US9221809, 219
SMILES: O=c1[nH]c(nc(N[C@@H]2CCCNC2)c1-c1csc(n1)-n1ccnc1)N1CCOCC1
InChI Key:
Data: 1 IC50
Activity Spreadsheet -- Enzyme Inhibition Constant Data from BindingDB
Found 1 hit for monomerid = 203660
Trg + Lig
Ki
nM
ΔG°
kcal/mole
IC50
nM
Kd
nM
EC50/IC50
nM
koff
s-1
kon
M-1s-1
pHTemp
°C
Interleukin-1 receptor-associated kinase 4
(Homo sapiens (Human))
BDBM203660
(US9221809, 219)
Show SMILES O=c1[nH]c(nc(N[C@@H]2CCCNC2)c1-c1csc(n1)-n1ccnc1)N1CCOCC1 |r|
Reactome pathway
US Patent
n/an/a 4n/an/an/an/a7.225
MERCK SHARP & DOHME CORP.
US Patent
Assay Description
A 20 ul reaction mixture contains 10 mM TriHCl, pH 7.2, 0.5 nM GST tagged IRAK4 (SignalChem), 100 nM fluorescent peptide substrate (RP7030, Molecul...
US Patent US9221809 (2015)
BindingDB Entry DOI: 10.7270/Q23B5XZM