BDBM2039 2,8-disubstituted dipyridodiazepinone 21::2-Chloro-5,11-dihydro-11-ethyl-5-methyl-8-(3-nitrophenylamino)methyl-6H-dipyrido[3,2-b:2 ,3 -e][1,4]diazepin-6-one::5-chloro-2-ethyl-9-methyl-13-(3-nitrophenoxymethyl)-2,4,9,15-tetraazatricyclo[9.4.0.0^{3,8}]pentadeca-1(11),3,5,7,12,14-hexaen-10-one
SMILES: CCN1c2nc(Cl)ccc2N(C)C(=O)c2cc(COc3cccc(c3)[N+]([O-])=O)cnc12
InChI Key: InChIKey=RAEHLIVJXCOVLZ-UHFFFAOYSA-N
Data: 3 IC50
Activity Spreadsheet -- Enzyme Inhibition Constant Data from BindingDB
Found 3 hits for monomerid = 2039
Trg + Lig
Ki
nM
ΔG°
kcal/mole
IC50
nM
Kd
nM
EC50/IC50
nM
koff
s-1
kon
M-1s-1
pHTemp
°C
HIV-1 Reverse Transcriptase
(Human immunodeficiency virus type 1)
BDBM2039
(2,8-disubstituted dipyridodiazepinone 21 | 2-Chlor...)
Show SMILES CCN1c2nc(Cl)ccc2N(C)C(=O)c2cc(COc3cccc(c3)[N+]([O-])=O)cnc12
Show InChI InChI=1S/C21H18ClN5O4/c1-3-26-19-16(21(28)25(2)17-7-8-18(22)24-20(17)26)9-13(11-23-19)12-31-15-6-4-5-14(10-15)27(29)30/h4-11H,3,12H2,1-2H3
n/an/a 170n/an/an/an/a7.822
Pfizer Inc.
Assay Description
The IC50 of reverse transcriptase is the concentration that inhibits 50% of recombinant HIV-1 RT RNA-directed DNA polymerase activity in vitro.
J Med Chem 51: 3804-13 (2008)
Article DOI: 10.1021/jm7015057
BindingDB Entry DOI: 10.7270/Q2DN437S
Human immunodeficiency virus type 1 reverse transcriptase
(Human immunodeficiency virus 1)
BDBM2039
(2,8-disubstituted dipyridodiazepinone 21 | 2-Chlor...)
Show SMILES CCN1c2nc(Cl)ccc2N(C)C(=O)c2cc(COc3cccc(c3)[N+]([O-])=O)cnc12
Show InChI InChI=1S/C21H18ClN5O4/c1-3-26-19-16(21(28)25(2)17-7-8-18(22)24-20(17)26)9-13(11-23-19)12-31-15-6-4-5-14(10-15)27(29)30/h4-11H,3,12H2,1-2H3
n/an/a 170n/an/an/an/an/an/a
Boehringer Ingelheim Pharmaceuticals Inc.
Assay Description
Inhibitory activity against HIV-1 wild-type reverse transcriptase.
J Med Chem 41: 2972-84 (1998)
Article DOI: 10.1021/jm9707030
BindingDB Entry DOI: 10.7270/Q2J964K7
HIV-1 Reverse Transcriptase Mutant (Y181C)
(Human immunodeficiency virus type 1)
BDBM2039
(2,8-disubstituted dipyridodiazepinone 21 | 2-Chlor...)
Show SMILES CCN1c2nc(Cl)ccc2N(C)C(=O)c2cc(COc3cccc(c3)[N+]([O-])=O)cnc12
Show InChI InChI=1S/C21H18ClN5O4/c1-3-26-19-16(21(28)25(2)17-7-8-18(22)24-20(17)26)9-13(11-23-19)12-31-15-6-4-5-14(10-15)27(29)30/h4-11H,3,12H2,1-2H3
n/an/a 350n/an/an/an/a7.822
Pfizer Inc.
Assay Description
The IC50 of reverse transcriptase is the concentration that inhibits 50% of recombinant HIV-1 RT RNA-directed DNA polymerase activity in vitro.
J Med Chem 51: 3804-13 (2008)
Article DOI: 10.1021/jm7015057
BindingDB Entry DOI: 10.7270/Q2DN437S