BDBM2040 2,8-disubstituted dipyridodiazepinone 23::2-Chloro-5,11-dihydro-11-ethyl-8-(3-methoxyphenyloxy)-methyl-5-methyl-6H-dipyrido[3,2-b:2 ,3 -e][1,4]diazepin-6-one::5-chloro-2-ethyl-13-(3-methoxyphenoxymethyl)-9-methyl-2,4,9,15-tetraazatricyclo[9.4.0.0^{3,8}]pentadeca-1(11),3,5,7,12,14-hexaen-10-one
SMILES: CCN1c2nc(Cl)ccc2N(C)C(=O)c2cc(COc3cccc(OC)c3)cnc12
InChI Key: InChIKey=HCXYAWFMXOIQEC-UHFFFAOYSA-N
Data: 3 IC50
Activity Spreadsheet -- Enzyme Inhibition Constant Data from BindingDB
Found 3 hits for monomerid = 2040
Trg + Lig
Ki
nM
ΔG°
kcal/mole
IC50
nM
Kd
nM
EC50/IC50
nM
koff
s-1
kon
M-1s-1
pHTemp
°C
HIV-1 Reverse Transcriptase
(Human immunodeficiency virus type 1)
BDBM2040
(2,8-disubstituted dipyridodiazepinone 23 | 2-Chlor...)
Show SMILES CCN1c2nc(Cl)ccc2N(C)C(=O)c2cc(COc3cccc(OC)c3)cnc12
Show InChI InChI=1S/C22H21ClN4O3/c1-4-27-20-17(22(28)26(2)18-8-9-19(23)25-21(18)27)10-14(12-24-20)13-30-16-7-5-6-15(11-16)29-3/h5-12H,4,13H2,1-3H3
n/an/a 100n/an/an/an/a7.822
Pfizer Inc.
Assay Description
The IC50 of reverse transcriptase is the concentration that inhibits 50% of recombinant HIV-1 RT RNA-directed DNA polymerase activity in vitro.
J Med Chem 51: 3804-13 (2008)
Article DOI: 10.1021/jm7015057
BindingDB Entry DOI: 10.7270/Q2DN437S
Human immunodeficiency virus type 1 reverse transcriptase
(Human immunodeficiency virus 1)
BDBM2040
(2,8-disubstituted dipyridodiazepinone 23 | 2-Chlor...)
Show SMILES CCN1c2nc(Cl)ccc2N(C)C(=O)c2cc(COc3cccc(OC)c3)cnc12
Show InChI InChI=1S/C22H21ClN4O3/c1-4-27-20-17(22(28)26(2)18-8-9-19(23)25-21(18)27)10-14(12-24-20)13-30-16-7-5-6-15(11-16)29-3/h5-12H,4,13H2,1-3H3
n/an/a 220n/an/an/an/an/an/a
Boehringer Ingelheim Pharmaceuticals Inc.
Assay Description
Inhibitory activity against HIV-1 Mutant Reverse transcriptase P236L
J Med Chem 41: 2972-84 (1998)
Article DOI: 10.1021/jm9707030
BindingDB Entry DOI: 10.7270/Q2J964K7
HIV-1 Reverse Transcriptase Mutant (Y181C)
(Human immunodeficiency virus type 1)
BDBM2040
(2,8-disubstituted dipyridodiazepinone 23 | 2-Chlor...)
Show SMILES CCN1c2nc(Cl)ccc2N(C)C(=O)c2cc(COc3cccc(OC)c3)cnc12
Show InChI InChI=1S/C22H21ClN4O3/c1-4-27-20-17(22(28)26(2)18-8-9-19(23)25-21(18)27)10-14(12-24-20)13-30-16-7-5-6-15(11-16)29-3/h5-12H,4,13H2,1-3H3
n/an/a 280n/an/an/an/a7.822
Pfizer Inc.
Assay Description
The IC50 of reverse transcriptase is the concentration that inhibits 50% of recombinant HIV-1 RT RNA-directed DNA polymerase activity in vitro.
J Med Chem 51: 3804-13 (2008)
Article DOI: 10.1021/jm7015057
BindingDB Entry DOI: 10.7270/Q2DN437S