BDBM20459 Tinyatoxin::[(1R,2R,6R,10S,11R,15R,17R)-13-benzyl-6-hydroxy-4,17-dimethyl-5-oxo-15-(prop-1-en-2-yl)-12,14,18-trioxapentacyclo[11.4.1.0^{1,10}.0^{2,6}.0^{11,15}]octadeca-3,8-dien-8-yl]methyl 2-(4-hydroxyphenyl)acetate
SMILES: [H][C@]12OC3(Cc4ccccc4)O[C@]1(C[C@@H](C)[C@]1(O3)[C@]3([H])C=C(C)C(=O)[C@@]3(O)CC(COC(=O)Cc3ccc(O)cc3)=C[C@@]21[H])C(C)=C
InChI Key: InChIKey=WWZMXEIBZCEIFB-BNTGGEEQSA-N
Data: 1 KI  1 EC50
Activity Spreadsheet -- Enzyme Inhibition Constant Data from BindingDB
Found 1 hit for monomerid = 20459
Trg + Lig
Ki
nM
ΔG°
kcal/mole
IC50
nM
Kd
nM
EC50/IC50
nM
koff
s-1
kon
M-1s-1
pHTemp
°C
Transient receptor potential cation channel subfamily V member 1
(Homo sapiens (Human))
BDBM20459
(Tinyatoxin | [(1R,2R,6R,10S,11R,15R,17R)-13-benzyl...)
Show SMILES [H][C@]12OC3(Cc4ccccc4)O[C@]1(C[C@@H](C)[C@]1(O3)[C@]3([H])C=C(C)C(=O)[C@@]3(O)CC(COC(=O)Cc3ccc(O)cc3)=C[C@@]21[H])C(C)=C |c:45,t:23,TLB:11:3:12.14.13:42,THB:4:3:12.14.13:42|
Show InChI InChI=1S/C36H38O8/c1-21(2)34-17-23(4)36-28(32(34)42-35(43-34,44-36)19-25-8-6-5-7-9-25)15-26(18-33(40)29(36)14-22(3)31(33)39)20-41-30(38)16-24-10-12-27(37)13-11-24/h5-15,23,28-29,32,37,40H,1,16-20H2,2-4H3/t23-,28+,29-,32-,33-,34-,35?,36-/m1/s1
Reactome pathway
589 -8.49n/an/a 129n/an/a7.425
Abbott Laboratories
Assay Description
The hTRPV1-expressing CHO cell membranes were incubated with [3H]A-778317 and test compounds to establish equilibrium. After incubation was terminate...
J Pharmacol Exp Ther 323: 285-93 (2007)
Article DOI: 10.1124/jpet.107.124305
BindingDB Entry DOI: 10.7270/Q28K77B0