null
SMILES: Cc1ccc2N(CCNC(=O)Nc3ccccc3Br)CCc2c1
InChI Key: InChIKey=GWTRXUMFQDUWKA-UHFFFAOYSA-N
Activity Spreadsheet -- Enzyme Inhibition Constant Data from BindingDB
Found 1 hit for monomerid = 20492
Trg + Lig
Ki
nM
ΔG°
kcal/mole
IC50
nM
Kd
nM
EC50/IC50
nM
koff
s-1
kon
M-1s-1
pHTemp
°C
Transient receptor potential cation channel subfamily V member 1
(Homo sapiens (Human))
BDBM20492
(1-(2-bromophenyl)-3-[2-(5-methyl-2,3-dihydro-1H-in...)
Show SMILES Cc1ccc2N(CCNC(=O)Nc3ccccc3Br)CCc2c1
Show InChI InChI=1S/C18H20BrN3O/c1-13-6-7-17-14(12-13)8-10-22(17)11-9-20-18(23)21-16-5-3-2-4-15(16)19/h2-7,12H,8-11H2,1H3,(H2,20,21,23)
Reactome pathway
n/an/an/an/a 50n/an/a7.225
GSK
Assay Description
One day before the assay was performed, human TRPV1 expressed in 1321N1 astrocytoma cells were plated onto 96-well assay plates and grown until 2.5 h...
Bioorg Med Chem Lett 16: 3287-91 (2006)
Article DOI: 10.1016/j.bmcl.2006.03.030
BindingDB Entry DOI: 10.7270/Q2125QX9