BDBM205105 3-methyl-2-{[(3r,6r)-6- methyl-1-{[2-methyl-6-(2h- 1,2,3-triazol-2- yl)phenyl]carbonyl}piperidin- 3-yl]oxy}pyridine-4- carbonitrile::US9546152, example 15
SMILES: C[C@@H]1CC[C@H](CN1C(=O)c1c(C)cccc1-n1nccn1)Oc1nccc(C#N)c1C
InChI Key: InChIKey=NNYOYMBIEDPXHF-VQIMIIECSA-N
Data: 2 KI  2 IC50
Activity Spreadsheet -- Enzyme Inhibition Constant Data from BindingDB
Found 4 hits for monomerid = 205105
Trg + Lig
Ki
nM
ΔG°
kcal/mole
IC50
nM
Kd
nM
EC50/IC50
nM
koff
s-1
kon
M-1s-1
pHTemp
°C
Orexin receptor type 2
(Homo sapiens (Human))
BDBM205105
(3-methyl-2-{[(3r,6r)-6- methyl-1-{[2-methyl-6-(2h-...)
Show SMILES C[C@@H]1CC[C@H](CN1C(=O)c1c(C)cccc1-n1nccn1)Oc1nccc(C#N)c1C |r|
Show InChI InChI=1S/C23H24N6O2/c1-15-5-4-6-20(29-26-11-12-27-29)21(15)23(30)28-14-19(8-7-16(28)2)31-22-17(3)18(13-24)9-10-25-22/h4-6,9-12,16,19H,7-8,14H2,1-3H3/t16-,19-/m1/s1
Reactome pathway
US Patent
0.200n/an/an/an/an/an/an/an/a
MERCK SHARP & DOHME CORP.
US Patent
Assay Description
Radioligand binding assay (described in Bergman et. al. Bioorg. Med. Chem. Lett. 2008, 18, 1425-1430) in which the inhibition constant (Ki) is determ...
US Patent US9546152 (2017)
BindingDB Entry DOI: 10.7270/Q2D50PZW
Orexin receptor type 1
(Homo sapiens (Human))
BDBM205105
(3-methyl-2-{[(3r,6r)-6- methyl-1-{[2-methyl-6-(2h-...)
Show SMILES C[C@@H]1CC[C@H](CN1C(=O)c1c(C)cccc1-n1nccn1)Oc1nccc(C#N)c1C |r|
Show InChI InChI=1S/C23H24N6O2/c1-15-5-4-6-20(29-26-11-12-27-29)21(15)23(30)28-14-19(8-7-16(28)2)31-22-17(3)18(13-24)9-10-25-22/h4-6,9-12,16,19H,7-8,14H2,1-3H3/t16-,19-/m1/s1
Reactome pathway
US Patent
178n/an/an/an/an/an/an/an/a
MERCK SHARP & DOHME CORP.
US Patent
Assay Description
Radioligand binding assay (described in Bergman et. al. Bioorg. Med. Chem. Lett. 2008, 18, 1425-1430) in which the inhibition constant (Ki) is determ...
US Patent US9546152 (2017)
BindingDB Entry DOI: 10.7270/Q2D50PZW
Orexin receptor type 2
(Homo sapiens (Human))
BDBM205105
(3-methyl-2-{[(3r,6r)-6- methyl-1-{[2-methyl-6-(2h-...)
Show SMILES C[C@@H]1CC[C@H](CN1C(=O)c1c(C)cccc1-n1nccn1)Oc1nccc(C#N)c1C |r|
Show InChI InChI=1S/C23H24N6O2/c1-15-5-4-6-20(29-26-11-12-27-29)21(15)23(30)28-14-19(8-7-16(28)2)31-22-17(3)18(13-24)9-10-25-22/h4-6,9-12,16,19H,7-8,14H2,1-3H3/t16-,19-/m1/s1
Reactome pathway
US Patent
n/an/a 12n/an/an/an/an/an/a
MERCK SHARP & DOHME CORP.
US Patent
Assay Description
The utility of the compounds in accordance with the present invention as orexin receptor OX1R and/or OX2R antagonists may be readily determined witho...
US Patent US9546152 (2017)
BindingDB Entry DOI: 10.7270/Q2D50PZW
Orexin receptor type 1
(Homo sapiens (Human))
BDBM205105
(3-methyl-2-{[(3r,6r)-6- methyl-1-{[2-methyl-6-(2h-...)
Show SMILES C[C@@H]1CC[C@H](CN1C(=O)c1c(C)cccc1-n1nccn1)Oc1nccc(C#N)c1C |r|
Show InChI InChI=1S/C23H24N6O2/c1-15-5-4-6-20(29-26-11-12-27-29)21(15)23(30)28-14-19(8-7-16(28)2)31-22-17(3)18(13-24)9-10-25-22/h4-6,9-12,16,19H,7-8,14H2,1-3H3/t16-,19-/m1/s1
Reactome pathway
US Patent
n/an/a 693n/an/an/an/an/an/a
MERCK SHARP & DOHME CORP.
US Patent
Assay Description
The utility of the compounds in accordance with the present invention as orexin receptor OX1R and/or OX2R antagonists may be readily determined witho...
US Patent US9546152 (2017)
BindingDB Entry DOI: 10.7270/Q2D50PZW