null
SMILES: CC(=O)Nc1nc2c(Oc3cc(ncn3)C3=CCC(CC3)C(F)(F)F)cccc2s1
InChI Key: InChIKey=BPHBCIKYYUQAFI-UHFFFAOYSA-N
Activity Spreadsheet -- Enzyme Inhibition Constant Data from BindingDB
Found 2 hits for monomerid = 20561
Trg + Lig
Ki
nM
ΔG°
kcal/mole
IC50
nM
Kd
nM
EC50/IC50
nM
koff
s-1
kon
M-1s-1
pHTemp
°C
Transient receptor potential cation channel subfamily V member 1
(Rattus norvegicus (rat))
BDBM20561
(N-[4-({6-[4-(trifluoromethyl)cyclohex-1-en-1-yl]py...)
Show SMILES CC(=O)Nc1nc2c(Oc3cc(ncn3)C3=CCC(CC3)C(F)(F)F)cccc2s1 |t:16|
Show InChI InChI=1S/C20H17F3N4O2S/c1-11(28)26-19-27-18-15(3-2-4-16(18)30-19)29-17-9-14(24-10-25-17)12-5-7-13(8-6-12)20(21,22)23/h2-5,9-10,13H,6-8H2,1H3,(H,26,27,28)
Reactome pathway
n/an/a 2.40n/an/an/an/an/an/a
Amgen
Assay Description
TRPV1 activities were monitored as a function of cellular uptake of radioactive calcium (45Ca2+). The test compounds were preincubated with TRPV1 exp...
J Med Chem 50: 3528-39 (2007)
Article DOI: 10.1021/jm070191h
BindingDB Entry DOI: 10.7270/Q2MW2FF4
Transient receptor potential cation channel subfamily V member 1
(Rattus norvegicus (rat))
BDBM20561
(N-[4-({6-[4-(trifluoromethyl)cyclohex-1-en-1-yl]py...)
Show SMILES CC(=O)Nc1nc2c(Oc3cc(ncn3)C3=CCC(CC3)C(F)(F)F)cccc2s1 |t:16|
Show InChI InChI=1S/C20H17F3N4O2S/c1-11(28)26-19-27-18-15(3-2-4-16(18)30-19)29-17-9-14(24-10-25-17)12-5-7-13(8-6-12)20(21,22)23/h2-5,9-10,13H,6-8H2,1H3,(H,26,27,28)
Reactome pathway
n/an/a 27n/an/an/an/a7.422
Amgen
Assay Description
TRPV1 activities were monitored as a function of cellular uptake of radioactive calcium (45Ca2+). The test compounds were preincubated with TRPV1 exp...
J Med Chem 50: 3528-39 (2007)
Article DOI: 10.1021/jm070191h
BindingDB Entry DOI: 10.7270/Q2MW2FF4