BDBM205725 US9255090, 194
SMILES: COc1cc(CC(O)=O)ccc1-c1ccc(F)c2CCN(Cc12)C(=O)CCc1ccccc1C
InChI Key: InChIKey=MEWKPJITPDNLAT-UHFFFAOYSA-N
Data: 1 IC50
Activity Spreadsheet -- Enzyme Inhibition Constant Data from BindingDB
Found 1 hit for monomerid = 205725
Trg + Lig
Ki
nM
ΔG°
kcal/mole
IC50
nM
Kd
nM
EC50/IC50
nM
koff
s-1
kon
M-1s-1
pHTemp
°C
G protein-coupled receptor 44
(Homo sapiens (Human))
BDBM205725
(US9255090, 194)
Show SMILES COc1cc(CC(O)=O)ccc1-c1ccc(F)c2CCN(Cc12)C(=O)CCc1ccccc1C
Show InChI InChI=1S/C28H28FNO4/c1-18-5-3-4-6-20(18)8-12-27(31)30-14-13-22-24(17-30)21(10-11-25(22)29)23-9-7-19(16-28(32)33)15-26(23)34-2/h3-7,9-11,15H,8,12-14,16-17H2,1-2H3,(H,32,33)
Reactome pathway
US Patent
n/an/a 0.75n/an/an/an/a7.025
ACTELION PHARMACEUTICALS LTD.
US Patent
Assay Description
Binding assay was performed in a final assay volume of 250 ul. First, 25 ul of test compound, previously diluted in Binding-Buffer (Binding-Buffer: 5...
US Patent US9255090 (2016)
BindingDB Entry DOI: 10.7270/Q2TQ60B2