BDBM20598 2-(3-hydroxyphenyl)-1-methyl-1-{4-[2-(pyrrolidin-1-yl)ethoxy]phenyl}-1,2,3,4-tetrahydroisoquinolin-6-ol::tetrahydroisoquinoline derivative, 19f
SMILES: CC1(N(CCc2cc(O)ccc12)c1cccc(O)c1)c1ccc(OCCN2CCCC2)cc1
InChI Key: InChIKey=COAUZXWBCIRBQG-UHFFFAOYSA-N
Data: 6 IC50  2 EC50
Activity Spreadsheet -- Enzyme Inhibition Constant Data from BindingDB
Found 6 hits for monomerid = 20598
Trg + Lig
Ki
nM
ΔG°
kcal/mole
IC50
nM
Kd
nM
EC50/IC50
nM
koff
s-1
kon
M-1s-1
pHTemp
°C
Estrogen receptor
(Homo sapiens (Human))
BDBM20598
(2-(3-hydroxyphenyl)-1-methyl-1-{4-[2-(pyrrolidin-1...)
Show SMILES CC1(N(CCc2cc(O)ccc12)c1cccc(O)c1)c1ccc(OCCN2CCCC2)cc1
Show InChI InChI=1S/C28H32N2O3/c1-28(22-7-10-26(11-8-22)33-18-17-29-14-2-3-15-29)27-12-9-25(32)19-21(27)13-16-30(28)23-5-4-6-24(31)20-23/h4-12,19-20,31-32H,2-3,13-18H2,1H3
n/an/a 31n/a 0.600n/an/a7.422
Novartis Pharmaceuticals
Assay Description
Radioligand binding assay was performed by using 96-well microtiterplates containing ER, 17beta-estradiol, and the test compound to be tested and SPA...
J Med Chem 46: 2945-57 (2003)
Article DOI: 10.1021/jm030086h
BindingDB Entry DOI: 10.7270/Q2H41PQQ
Estradiol receptor beta (ERβ)
(Homo sapiens (Human))
BDBM20598
(2-(3-hydroxyphenyl)-1-methyl-1-{4-[2-(pyrrolidin-1...)
Show SMILES CC1(N(CCc2cc(O)ccc12)c1cccc(O)c1)c1ccc(OCCN2CCCC2)cc1
Show InChI InChI=1S/C28H32N2O3/c1-28(22-7-10-26(11-8-22)33-18-17-29-14-2-3-15-29)27-12-9-25(32)19-21(27)13-16-30(28)23-5-4-6-24(31)20-23/h4-12,19-20,31-32H,2-3,13-18H2,1H3
n/an/a 190n/a 33n/an/an/a25
Novartis Pharmaceuticals
Assay Description
Radioligand binding assay was performed by using 96-well microtiterplates containing ER, 17beta-estradiol, and the test compound to be tested and SPA...
J Med Chem 46: 2945-57 (2003)
Article DOI: 10.1021/jm030086h
BindingDB Entry DOI: 10.7270/Q2H41PQQ
Estradiol receptor beta (ERβ)
(Homo sapiens (Human))
BDBM20598
(2-(3-hydroxyphenyl)-1-methyl-1-{4-[2-(pyrrolidin-1...)
Show SMILES CC1(N(CCc2cc(O)ccc12)c1cccc(O)c1)c1ccc(OCCN2CCCC2)cc1
Show InChI InChI=1S/C28H32N2O3/c1-28(22-7-10-26(11-8-22)33-18-17-29-14-2-3-15-29)27-12-9-25(32)19-21(27)13-16-30(28)23-5-4-6-24(31)20-23/h4-12,19-20,31-32H,2-3,13-18H2,1H3
n/an/a 190n/an/an/an/an/an/a
University of Calcutta
Curated by ChEMBL
Assay Description
Inhibition of binding to human estrogen receptor beta
Bioorg Med Chem Lett 15: 957-61 (2005)
Article DOI: 10.1016/j.bmcl.2004.12.048
BindingDB Entry DOI: 10.7270/Q28S4R5W
Estradiol receptor beta (ERβ)
(Homo sapiens (Human))
BDBM20598
(2-(3-hydroxyphenyl)-1-methyl-1-{4-[2-(pyrrolidin-1...)
Show SMILES CC1(N(CCc2cc(O)ccc12)c1cccc(O)c1)c1ccc(OCCN2CCCC2)cc1
Show InChI InChI=1S/C28H32N2O3/c1-28(22-7-10-26(11-8-22)33-18-17-29-14-2-3-15-29)27-12-9-25(32)19-21(27)13-16-30(28)23-5-4-6-24(31)20-23/h4-12,19-20,31-32H,2-3,13-18H2,1H3
n/an/a 33.0n/an/an/an/an/an/a
University of Calcutta
Curated by ChEMBL
Assay Description
Inhibition of transcriptional activation by human estrogen receptor beta
Bioorg Med Chem Lett 15: 957-61 (2005)
Article DOI: 10.1016/j.bmcl.2004.12.048
BindingDB Entry DOI: 10.7270/Q28S4R5W
Estrogen receptor
(Homo sapiens (Human))
BDBM20598
(2-(3-hydroxyphenyl)-1-methyl-1-{4-[2-(pyrrolidin-1...)
Show SMILES CC1(N(CCc2cc(O)ccc12)c1cccc(O)c1)c1ccc(OCCN2CCCC2)cc1
Show InChI InChI=1S/C28H32N2O3/c1-28(22-7-10-26(11-8-22)33-18-17-29-14-2-3-15-29)27-12-9-25(32)19-21(27)13-16-30(28)23-5-4-6-24(31)20-23/h4-12,19-20,31-32H,2-3,13-18H2,1H3
n/an/a 0.600n/an/an/an/an/an/a
University of Calcutta
Curated by ChEMBL
Assay Description
Inhibition of transcriptional activation by human estrogen receptor alpha
Bioorg Med Chem Lett 15: 957-61 (2005)
Article DOI: 10.1016/j.bmcl.2004.12.048
BindingDB Entry DOI: 10.7270/Q28S4R5W
Estrogen receptor
(Homo sapiens (Human))
BDBM20598
(2-(3-hydroxyphenyl)-1-methyl-1-{4-[2-(pyrrolidin-1...)
Show SMILES CC1(N(CCc2cc(O)ccc12)c1cccc(O)c1)c1ccc(OCCN2CCCC2)cc1
Show InChI InChI=1S/C28H32N2O3/c1-28(22-7-10-26(11-8-22)33-18-17-29-14-2-3-15-29)27-12-9-25(32)19-21(27)13-16-30(28)23-5-4-6-24(31)20-23/h4-12,19-20,31-32H,2-3,13-18H2,1H3
n/an/a 31.0n/an/an/an/an/an/a
University of Calcutta
Curated by ChEMBL
Assay Description
Inhibition of binding to human estrogen receptor alpha
Bioorg Med Chem Lett 15: 957-61 (2005)
Article DOI: 10.1016/j.bmcl.2004.12.048
BindingDB Entry DOI: 10.7270/Q28S4R5W