null
SMILES: CN1CCN(Cc2ccc(NC(=O)c3ccc(C)c(c3)C#Cc3cnc4[nH]ccc4n3)cc2C(F)(F)F)CC1
InChI Key: InChIKey=CPUMMWVRFYEEPF-UHFFFAOYSA-N
Activity Spreadsheet -- Enzyme Inhibition Constant Data from BindingDB
Found 1 hit for monomerid = 206084
Trg + Lig
Ki
nM
ΔG°
kcal/mole
IC50
nM
Kd
nM
EC50/IC50
nM
koff
s-1
kon
M-1s-1
pHTemp
°C
Tyrosine-protein kinase ABL1 [T315I]
(Homo sapiens (Human))
BDBM206084
(US9255107, 3)
Show SMILES CN1CCN(Cc2ccc(NC(=O)c3ccc(C)c(c3)C#Cc3cnc4[nH]ccc4n3)cc2C(F)(F)F)CC1
Show InChI InChI=1S/C29H27F3N6O/c1-19-3-4-21(15-20(19)5-8-24-17-34-27-26(35-24)9-10-33-27)28(39)36-23-7-6-22(25(16-23)29(30,31)32)18-38-13-11-37(2)12-14-38/h3-4,6-7,9-10,15-17H,11-14,18H2,1-2H3,(H,33,34)(H,36,39)
US Patent
n/an/a 2.12n/an/an/an/an/a25
NANJING SANHOME PHARMACEUTICAL CO., LTD.
US Patent
Assay Description
Serially diluting the compound of the present invention from 1 uM initial concentration in three-fold fashion and formulating 10 concentrations (50.8...
US Patent US9255107 (2016)
BindingDB Entry DOI: 10.7270/Q22806F9