BDBM20626 2-phenyl-1-benzothiophen-6-ol::benzthiophene compound, 1
SMILES: Oc1ccc2cc(sc2c1)-c1ccccc1
InChI Key: InChIKey=BTCAHHDEULKYID-UHFFFAOYSA-N
Data: 2 IC50  2 EC50
PDB links: 5 PDB IDs contain this monomer as substructures. 7 PDB IDs contain inhibitors having a similarity of 90% to this monomer.
Activity Spreadsheet -- Enzyme Inhibition Constant Data from BindingDB
Found 2 hits for monomerid = 20626
Trg + Lig
Ki
nM
ΔG°
kcal/mole
IC50
nM
Kd
nM
EC50/IC50
nM
koff
s-1
kon
M-1s-1
pHTemp
°C
Estradiol receptor beta (ERβ)
(Homo sapiens (Human))
BDBM20626
(2-phenyl-1-benzothiophen-6-ol | benzthiophene comp...)
Show SMILES Oc1ccc2cc(sc2c1)-c1ccccc1
Show InChI InChI=1S/C14H10OS/c15-12-7-6-11-8-13(16-14(11)9-12)10-4-2-1-3-5-10/h1-9,15H
n/an/a 4.31E+3n/a 166n/an/a7.422
Novartis Pharmaceuticals
Assay Description
Radioligand binding assay was performed by using 96-well microtiterplates containing ER, 17beta-estradiol, and the test compound to be tested and SPA...
J Med Chem 45: 1399-401 (2002)
Article DOI: 10.1021/jm015577l
BindingDB Entry DOI: 10.7270/Q27M0665
Estrogen receptor
(Homo sapiens (Human))
BDBM20626
(2-phenyl-1-benzothiophen-6-ol | benzthiophene comp...)
Show SMILES Oc1ccc2cc(sc2c1)-c1ccccc1
Show InChI InChI=1S/C14H10OS/c15-12-7-6-11-8-13(16-14(11)9-12)10-4-2-1-3-5-10/h1-9,15H
n/an/a 3.71E+3n/a 209n/an/a7.422
Novartis Pharmaceuticals
Assay Description
Radioligand binding assay was performed by using 96-well microtiterplates containing ER, 17beta-estradiol, and the test compound to be tested and SPA...
J Med Chem 45: 1399-401 (2002)
Article DOI: 10.1021/jm015577l
BindingDB Entry DOI: 10.7270/Q27M0665