BDBM206269 (S)-N1-(1-(butylamino)-3-(1H-indol-3-yl)-1-oxopropan-2-yl)-N4-hydroxyterephthalamide (8c)
SMILES: CCCCNC(=O)[C@@H](NC(=O)c1ccc(cc1)C(=O)NO)c1c[nH]c2ccccc12
InChI Key:
Data: 1 IC50
Activity Spreadsheet -- Enzyme Inhibition Constant Data from BindingDB
Found 1 hit for monomerid = 206269
Trg + Lig
Ki
nM
ΔG°
kcal/mole
IC50
nM
Kd
nM
EC50/IC50
nM
koff
s-1
kon
M-1s-1
pHTemp
°C
Histone acetylases (HDACs)
(Homo sapiens (Human))
BDBM206269
((S)-N1-(1-(butylamino)-3-(1H-indol-3-yl)-1-oxoprop...)
Show SMILES CCCCNC(=O)[C@@H](NC(=O)c1ccc(cc1)C(=O)NO)c1c[nH]c2ccccc12 |r|
n/an/a 1.74E+3n/an/an/an/an/an/a
Shandong University
Assay Description
In brief, 10 μL of HeLa nuclear extract was mixed with various concentrations of target compounds (50 μL), SAHA, using 100% and none HDACs ...
Chem Biol Drug Des 89: 38-46 (2017)
Article DOI: 10.1111/cbdd.12819
BindingDB Entry DOI: 10.7270/Q2SQ8Z69