null
SMILES: N[C@H]1CCCN(C1)c1cccc(n1)-c1n[nH]c2cnc(cc12)-c1cccnc1
InChI Key:
Activity Spreadsheet -- Enzyme Inhibition Constant Data from BindingDB
Found 4 hits for monomerid = 206420
Trg + Lig
Ki
nM
ΔG°
kcal/mole
IC50
nM
Kd
nM
EC50/IC50
nM
koff
s-1
kon
M-1s-1
pHTemp
°C
Serine/threonine-protein kinase pim-3
(Homo sapiens (Human))
BDBM206420
(US9260425, 161)
Show SMILES N[C@H]1CCCN(C1)c1cccc(n1)-c1n[nH]c2cnc(cc12)-c1cccnc1 |r|
0.0200n/an/an/an/an/an/an/an/a
Genentech
Curated by ChEMBL
Assay Description
Inhibition of PIM3 (unknown origin) using 5FAM-ARKRRRHPSGPPTA as substrate after 90 mins in presence of ATP by caliper microfluidic mobility shift as...
J Med Chem 60: 4458-4473 (2017)
Article DOI: 10.1021/acs.jmedchem.7b00418
BindingDB Entry DOI: 10.7270/Q2H997PN
Serine/threonine-protein kinase pim-1
(Homo sapiens (Human))
BDBM206420
(US9260425, 161)
Show SMILES N[C@H]1CCCN(C1)c1cccc(n1)-c1n[nH]c2cnc(cc12)-c1cccnc1 |r|
0.0400n/an/an/an/an/an/an/an/a
Genentech
Curated by ChEMBL
Assay Description
Inhibition of PIM1 (unknown origin) using 5FAM-ARKRRRHPSGPPTA as substrate after 90 mins in presence of ATP by caliper microfluidic mobility shift as...
J Med Chem 60: 4458-4473 (2017)
Article DOI: 10.1021/acs.jmedchem.7b00418
BindingDB Entry DOI: 10.7270/Q2H997PN
Serine/threonine-protein kinase pim-1
(Homo sapiens (Human))
BDBM206420
(US9260425, 161)
Show SMILES N[C@H]1CCCN(C1)c1cccc(n1)-c1n[nH]c2cnc(cc12)-c1cccnc1 |r|
US Patent
0.0411n/an/an/an/an/an/a7.2n/a
Genetech, Inc.
US Patent
Assay Description
PIM-1, PIM-2, and PIM-3 enzymes were generated as fusion proteins expressed in bacteria and purified by IMAC column chromatography (Sun, X., Chiu, J....
US Patent US9260425 (2016)
BindingDB Entry DOI: 10.7270/Q2RR1X3X
Serine/threonine-protein kinase pim-2
(Homo sapiens (Human))
BDBM206420
(US9260425, 161)
Show SMILES N[C@H]1CCCN(C1)c1cccc(n1)-c1n[nH]c2cnc(cc12)-c1cccnc1 |r|
0.200n/an/an/an/an/an/an/an/a
Genentech
Curated by ChEMBL
Assay Description
Inhibition of PIM2 (unknown origin) using 5FAM-ARKRRRHPSGPPTA as substrate after 90 mins in presence of ATP by caliper microfluidic mobility shift as...
J Med Chem 60: 4458-4473 (2017)
Article DOI: 10.1021/acs.jmedchem.7b00418
BindingDB Entry DOI: 10.7270/Q2H997PN