BDBM20654 N-cyclopentyl-4-{[5-(methoxycarbamoyl)-2-methylphenyl]amino}-5-methylpyrrolo[1,2-a][1,2,4]triazine-6-carboxamide::pyrrolo[2,1-f][1,2,4]triazine analogue, 11g
SMILES: CONC(=O)c1ccc(C)c(Nc2ncnn3cc(C(=O)NC4CCCC4)c(C)c23)c1
InChI Key: InChIKey=CULVHXCZWZHJGG-UHFFFAOYSA-N
Data: 1 IC50  1 EC50
Activity Spreadsheet -- Enzyme Inhibition Constant Data from BindingDB
Found 1 hit for monomerid = 20654
Trg + Lig
Ki
nM
ΔG°
kcal/mole
IC50
nM
Kd
nM
EC50/IC50
nM
koff
s-1
kon
M-1s-1
pHTemp
°C
Mitogen-activated protein kinase 14
(Homo sapiens (Human))
BDBM20654
(N-cyclopentyl-4-{[5-(methoxycarbamoyl)-2-methylphe...)
Show SMILES CONC(=O)c1ccc(C)c(Nc2ncnn3cc(C(=O)NC4CCCC4)c(C)c23)c1
Show InChI InChI=1S/C22H26N6O3/c1-13-8-9-15(21(29)27-31-3)10-18(13)26-20-19-14(2)17(11-28(19)24-12-23-20)22(30)25-16-6-4-5-7-16/h8-12,16H,4-7H2,1-3H3,(H,25,30)(H,27,29)(H,23,24,26)
NCI pathway
Reactome pathway
n/an/a 8n/a 43n/an/a7.522
Novartis Pharmaceuticals
Assay Description
The kinase activity was determined by quantitation of the amount of radioactive phosphate transferred to myelin basic protein (MBP) with or without i...
J Med Chem 51: 4-16 (2008)
Article DOI: 10.1021/jm7009414
BindingDB Entry DOI: 10.7270/Q23T9FHB