BDBM206774 (S,S)- 4::US9492405, (S,S)-4
SMILES: C[C@@H](Cc1cccc(N)c1)NC[C@@H](O)c1cc(O)cc(O)c1
InChI Key: InChIKey=YSDUJIGQJOLYND-APPDUMDISA-N
Data: 2 KI  1 Kd
Activity Spreadsheet -- Enzyme Inhibition Constant Data from BindingDB
Found 3 hits for monomerid = 206774
Trg + Lig
Ki
nM
ΔG°
kcal/mole
IC50
nM
Kd
nM
EC50/IC50
nM
koff
s-1
kon
M-1s-1
pHTemp
°C
Beta-2 adrenergic receptor
(Homo sapiens (Human))
BDBM206774
((S,S)- 4 | US9492405, (S,S)-4)
Show SMILES C[C@@H](Cc1cccc(N)c1)NC[C@@H](O)c1cc(O)cc(O)c1 |r|
Show InChI InChI=1S/C17H22N2O3/c1-11(5-12-3-2-4-14(18)6-12)19-10-17(22)13-7-15(20)9-16(21)8-13/h2-4,6-9,11,17,19-22H,5,10,18H2,1H3/t11-,17+/m0/s1
Reactome pathway
US Patent
2.87E+4 -5.76n/an/an/an/an/a7.84
The United States of America, as represented by the Secretary, Department of Health and Human Services; SRI International
US Patent
Assay Description
Beta1-AR binding was done on rat cortical membrane following a previously described procedure (Beer et al., Biochem. Pharmacol. 37: 1145-1151, 1988)....
US Patent US9492405 (2016)
BindingDB Entry DOI: 10.7270/Q2CJ8CBM
Beta-1 adrenergic receptor
(Rattus norvegicus (Rat))
BDBM206774
((S,S)- 4 | US9492405, (S,S)-4)
Show SMILES C[C@@H](Cc1cccc(N)c1)NC[C@@H](O)c1cc(O)cc(O)c1 |r|
Show InChI InChI=1S/C17H22N2O3/c1-11(5-12-3-2-4-14(18)6-12)19-10-17(22)13-7-15(20)9-16(21)8-13/h2-4,6-9,11,17,19-22H,5,10,18H2,1H3/t11-,17+/m0/s1
Reactome pathway
US Patent
>1.00E+5>-5.07n/an/an/an/an/a7.84
The United States of America, as represented by the Secretary, Department of Health and Human Services; SRI International
US Patent
Assay Description
Beta1-AR binding was done on rat cortical membrane following a previously described procedure (Beer et al., Biochem. Pharmacol. 37: 1145-1151, 1988)....
US Patent US9492405 (2016)
BindingDB Entry DOI: 10.7270/Q2CJ8CBM
Beta-2 adrenergic receptor
(Homo sapiens (Human))
BDBM206774
((S,S)- 4 | US9492405, (S,S)-4)
Show SMILES C[C@@H](Cc1cccc(N)c1)NC[C@@H](O)c1cc(O)cc(O)c1 |r|
Show InChI InChI=1S/C17H22N2O3/c1-11(5-12-3-2-4-14(18)6-12)19-10-17(22)13-7-15(20)9-16(21)8-13/h2-4,6-9,11,17,19-22H,5,10,18H2,1H3/t11-,17+/m0/s1
Reactome pathway
US Patent
n/an/an/a 2.88E+4n/an/an/a7.7n/a
The United States of America, as represented by the Secretary, Department of Health and Human Services; SRI International
US Patent
Assay Description
HEK 293 cells stability transfected with cDNA encoding human beta2-AR (provided by Dr. Brian Kobilka, Stanford Medical Center, Palo Alto, Calif.) wer...
US Patent US9492405 (2016)
BindingDB Entry DOI: 10.7270/Q2CJ8CBM