BDBM20760 9-butyl-8-[(7-fluoro-1,3-benzothiazol-2-yl)sulfanyl]-9H-purin-6-amine::Benzothiazole analogue, 13
SMILES: CCCCn1c(Sc2nc3cccc(F)c3s2)nc2c(N)ncnc12
InChI Key: InChIKey=UFONZWQOAQHFBD-UHFFFAOYSA-N
Data: 1 EC50
Activity Spreadsheet -- Enzyme Inhibition Constant Data from BindingDB
Found 1 hit for monomerid = 20760
Trg + Lig
Ki
nM
ΔG°
kcal/mole
IC50
nM
Kd
nM
EC50/IC50
nM
koff
s-1
kon
M-1s-1
pHTemp
°C
Heat shock protein HSP 90-beta
(Homo sapiens (Human))
BDBM20760
(9-butyl-8-[(7-fluoro-1,3-benzothiazol-2-yl)sulfany...)
Show SMILES CCCCn1c(Sc2nc3cccc(F)c3s2)nc2c(N)ncnc12
Show InChI InChI=1S/C16H15FN6S2/c1-2-3-7-23-14-11(13(18)19-8-20-14)22-15(23)25-16-21-10-6-4-5-9(17)12(10)24-16/h4-6,8H,2-3,7H2,1H3,(H2,18,19,20)
Reactome pathway
n/an/an/an/a 200n/an/a7.237
Conforma Therapeutics Corporation
Assay Description
EC50 was defined as the concentration of the compound at which there was 50% degradation of the Her-2/neu protein in MCF7 breast carcinoma cells. Sam...
J Med Chem 49: 5352-62 (2006)
Article DOI: 10.1021/jm051146h
BindingDB Entry DOI: 10.7270/Q26M354P