BDBM207623 US10501467, Example 68::US9260440, 68::US9617273, Example 68
SMILES: C[C@]12CCCN1Cc1n[nH]c(=O)c3cccc4[nH]c2c1c34
InChI Key: InChIKey=FFJICSMRLYFXCA-MRXNPFEDSA-N
Data: 9 IC50
Activity Spreadsheet -- Enzyme Inhibition Constant Data from BindingDB
Found 11 hits for monomerid = 207623
Trg + Lig
Ki
nM
ΔG°
kcal/mole
IC50
nM
Kd
nM
EC50/IC50
nM
koff
s-1
kon
M-1s-1
pHTemp
°C
Poly [ADP-ribose] polymerase 1
(Homo sapiens (Human))
BDBM207623
(US10501467, Example 68 | US9260440, 68 | US9617273...)
Show SMILES C[C@]12CCCN1Cc1n[nH]c(=O)c3cccc4[nH]c2c1c34 |r|
Show InChI InChI=1S/C16H14N4O/c1-16-6-3-7-20(16)8-11-13-12-9(15(21)19-18-11)4-2-5-10(12)17-14(13)16/h2,4-5H,3,6-8H2,1H3/t16-/m1/s1
US Patent
n/an/a 1.10n/an/an/an/a8.0n/a
BeiGene, Ltd.
US Patent
Assay Description
PARP-1 enzymatic assay was conducted using a method modified from HT F Homogeneous PARP Inhibition Assay Kit (Trevigen). 8.8 nM PARP-1 was pre-incuba...
US Patent US9260440 (2016)
BindingDB Entry DOI: 10.7270/Q2QV3KBD
Poly [ADP-ribose] polymerase 2
(Homo sapiens (Human))
BDBM207623
(US10501467, Example 68 | US9260440, 68 | US9617273...)
Show SMILES C[C@]12CCCN1Cc1n[nH]c(=O)c3cccc4[nH]c2c1c34 |r|
Show InChI InChI=1S/C16H14N4O/c1-16-6-3-7-20(16)8-11-13-12-9(15(21)19-18-11)4-2-5-10(12)17-14(13)16/h2,4-5H,3,6-8H2,1H3/t16-/m1/s1
US Patent
n/an/a 0.400n/an/an/an/an/an/a
BeiGene, Ltd.
US Patent
Assay Description
PARP-2 and PARP-3 enzymatic assays were conducted using commercial PARP-2/PARP-3 Chemiluminescent Assay Kit (BPS Biosciences) and the protocols with ...
US Patent US9260440 (2016)
BindingDB Entry DOI: 10.7270/Q2QV3KBD
Poly [ADP-ribose] polymerase tankyrase-2
(Homo sapiens (Human))
BDBM207623
(US10501467, Example 68 | US9260440, 68 | US9617273...)
Show SMILES C[C@]12CCCN1Cc1n[nH]c(=O)c3cccc4[nH]c2c1c34 |r|
Show InChI InChI=1S/C16H14N4O/c1-16-6-3-7-20(16)8-11-13-12-9(15(21)19-18-11)4-2-5-10(12)17-14(13)16/h2,4-5H,3,6-8H2,1H3/t16-/m1/s1
US Patent
n/an/a 1.22E+3n/an/an/an/an/an/a
BeiGene, Ltd.
US Patent
Assay Description
Tankyrase-2 enzymatic assay was conducted using commercial Tankyrase-2 Chemiluminescent Assay Kit (BPS Biosciences) and the protocol with the kit. GS...
US Patent US9260440 (2016)
BindingDB Entry DOI: 10.7270/Q2QV3KBD
Poly [ADP-ribose] polymerase 1
(Homo sapiens (Human))
BDBM207623
(US10501467, Example 68 | US9260440, 68 | US9617273...)
Show SMILES C[C@]12CCCN1Cc1n[nH]c(=O)c3cccc4[nH]c2c1c34 |r|
Show InChI InChI=1S/C16H14N4O/c1-16-6-3-7-20(16)8-11-13-12-9(15(21)19-18-11)4-2-5-10(12)17-14(13)16/h2,4-5H,3,6-8H2,1H3/t16-/m1/s1
US Patent
n/an/a 1.10E+3n/an/an/an/an/an/a
BeiGene, Ltd.
US Patent
Assay Description
PARP-1 enzymatic assay was conducted using a method modified from HT F Homogeneous PARP Inhibition Assay Kit (Trevigen). 8.8 nM PARP-1 was pre-incuba...
US Patent US9617273 (2017)
BindingDB Entry DOI: 10.7270/Q2CN75ZV
Poly [ADP-ribose] polymerase 2
(Homo sapiens (Human))
BDBM207623
(US10501467, Example 68 | US9260440, 68 | US9617273...)
Show SMILES C[C@]12CCCN1Cc1n[nH]c(=O)c3cccc4[nH]c2c1c34 |r|
Show InChI InChI=1S/C16H14N4O/c1-16-6-3-7-20(16)8-11-13-12-9(15(21)19-18-11)4-2-5-10(12)17-14(13)16/h2,4-5H,3,6-8H2,1H3/t16-/m1/s1
US Patent
n/an/a 400n/an/an/an/an/an/a
BeiGene, Ltd.
US Patent
Assay Description
PARP-2 and PARP-3 enzymatic assays were conducted using commercial PARP-2/PARP-3 Chemiluminescent Assay Kit (BPS Biosciences) and the protocols with ...
US Patent US9617273 (2017)
BindingDB Entry DOI: 10.7270/Q2CN75ZV
Poly [ADP-ribose] polymerase 1
(Homo sapiens (Human))
BDBM207623
(US10501467, Example 68 | US9260440, 68 | US9617273...)
Show SMILES C[C@]12CCCN1Cc1n[nH]c(=O)c3cccc4[nH]c2c1c34 |r|
Show InChI InChI=1S/C16H14N4O/c1-16-6-3-7-20(16)8-11-13-12-9(15(21)19-18-11)4-2-5-10(12)17-14(13)16/h2,4-5H,3,6-8H2,1H3/t16-/m1/s1
n/an/a 8.20n/an/an/an/an/an/a
TBA
Citation and Details
Poly [ADP-ribose] polymerase 1
(Homo sapiens (Human))
BDBM207623
(US10501467, Example 68 | US9260440, 68 | US9617273...)
Show SMILES C[C@]12CCCN1Cc1n[nH]c(=O)c3cccc4[nH]c2c1c34 |r|
Show InChI InChI=1S/C16H14N4O/c1-16-6-3-7-20(16)8-11-13-12-9(15(21)19-18-11)4-2-5-10(12)17-14(13)16/h2,4-5H,3,6-8H2,1H3/t16-/m1/s1
US Patent
n/an/a 1.10E+3n/an/an/an/an/an/a
BEIGENE, LTD.
US Patent
Assay Description
PARP-1 enzymatic assay was conducted using a method modified from HT F Homogeneous PARP Inhibition Assay Kit (Trevigen). 8.8 nM PARP-1 was pre-incuba...
US Patent US10501467 (2019)
BindingDB Entry DOI: 10.7270/Q2Z89FS5
Poly [ADP-ribose] polymerase 2
(Homo sapiens (Human))
BDBM207623
(US10501467, Example 68 | US9260440, 68 | US9617273...)
Show SMILES C[C@]12CCCN1Cc1n[nH]c(=O)c3cccc4[nH]c2c1c34 |r|
Show InChI InChI=1S/C16H14N4O/c1-16-6-3-7-20(16)8-11-13-12-9(15(21)19-18-11)4-2-5-10(12)17-14(13)16/h2,4-5H,3,6-8H2,1H3/t16-/m1/s1
US Patent
n/an/a 400n/an/an/an/an/an/a
BEIGENE, LTD.
US Patent
Assay Description
PARP-2 and PARP-3 enzymatic assays were conducted using commercial PARP-2/PARP-3 Chemiluminescent Assay Kit (BPS Biosciences) and the protocols with ...
US Patent US10501467 (2019)
BindingDB Entry DOI: 10.7270/Q2Z89FS5
TPoly [ADP-ribose] polymerase tankyrase-2
(Homo sapiens (Human))
BDBM207623
(US10501467, Example 68 | US9260440, 68 | US9617273...)
Show SMILES C[C@]12CCCN1Cc1n[nH]c(=O)c3cccc4[nH]c2c1c34 |r|
Show InChI InChI=1S/C16H14N4O/c1-16-6-3-7-20(16)8-11-13-12-9(15(21)19-18-11)4-2-5-10(12)17-14(13)16/h2,4-5H,3,6-8H2,1H3/t16-/m1/s1
US Patent
n/an/a 1.22E+6n/an/an/an/an/an/a
BEIGENE, LTD.
US Patent
Assay Description
Tankyrase-2 enzymatic assay was conducted using commercial Tankyrase-2 Chemiluminescent Assay Kit (BPS Biosciences) and the protocol with the kit. GS...
US Patent US10501467 (2019)
BindingDB Entry DOI: 10.7270/Q2Z89FS5
Poly [ADP-ribose] polymerase 1
(Homo sapiens (Human))
BDBM207623
(US10501467, Example 68 | US9260440, 68 | US9617273...)
Show SMILES C[C@]12CCCN1Cc1n[nH]c(=O)c3cccc4[nH]c2c1c34 |r|
Show InChI InChI=1S/C16H14N4O/c1-16-6-3-7-20(16)8-11-13-12-9(15(21)19-18-11)4-2-5-10(12)17-14(13)16/h2,4-5H,3,6-8H2,1H3/t16-/m1/s1
n/an/an/an/a 0.600n/an/an/an/a
TBA
Citation and Details
Poly [ADP-ribose] polymerase tankyrase-2
(Homo sapiens (Human))
BDBM207623
(US10501467, Example 68 | US9260440, 68 | US9617273...)
Show SMILES C[C@]12CCCN1Cc1n[nH]c(=O)c3cccc4[nH]c2c1c34 |r|
Show InChI InChI=1S/C16H14N4O/c1-16-6-3-7-20(16)8-11-13-12-9(15(21)19-18-11)4-2-5-10(12)17-14(13)16/h2,4-5H,3,6-8H2,1H3/t16-/m1/s1
US Patent
n/an/a 1.22E+6n/an/an/an/an/an/a
BeiGene, Ltd.
US Patent
Assay Description
Tankyrase-2 enzymatic assay was conducted using commercial Tankyrase-2 Chemiluminescent Assay Kit (BPS Biosciences) and the protocol with the kit. GS...
US Patent US9617273 (2017)
BindingDB Entry DOI: 10.7270/Q2CN75ZV