BDBM20772 5-{6-amino-8-[(7-chloro-1,3-benzothiazol-2-yl)sulfanyl]-9H-purin-9-yl}pentanenitrile::Benzothiazole analogue, 25
SMILES: Nc1ncnc2n(CCCCC#N)c(Sc3nc4cccc(Cl)c4s3)nc12
InChI Key: InChIKey=VDMMKENUYLBUEL-UHFFFAOYSA-N
Data: 1 EC50
Activity Spreadsheet -- Enzyme Inhibition Constant Data from BindingDB
Found 1 hit for monomerid = 20772
Trg + Lig
Ki
nM
ΔG°
kcal/mole
IC50
nM
Kd
nM
EC50/IC50
nM
koff
s-1
kon
M-1s-1
pHTemp
°C
Heat shock protein HSP 90-beta
(Homo sapiens (Human))
BDBM20772
(5-{6-amino-8-[(7-chloro-1,3-benzothiazol-2-yl)sulf...)
Show SMILES Nc1ncnc2n(CCCCC#N)c(Sc3nc4cccc(Cl)c4s3)nc12
Show InChI InChI=1S/C17H14ClN7S2/c18-10-5-4-6-11-13(10)26-17(23-11)27-16-24-12-14(20)21-9-22-15(12)25(16)8-3-1-2-7-19/h4-6,9H,1-3,8H2,(H2,20,21,22)
Reactome pathway
n/an/an/an/a 110n/an/a7.237
Conforma Therapeutics Corporation
Assay Description
EC50 was defined as the concentration of the compound at which there was 50% degradation of the Her-2/neu protein in MCF7 breast carcinoma cells. Sam...
J Med Chem 49: 5352-62 (2006)
Article DOI: 10.1021/jm051146h
BindingDB Entry DOI: 10.7270/Q26M354P