null
SMILES: COc1cc(Cn2cnc3c(Br)nc(N)nc23)c(Br)c(OC)c1OC
InChI Key: InChIKey=ZPHYUOVEFQKPCV-UHFFFAOYSA-N
Activity Spreadsheet -- Enzyme Inhibition Constant Data from BindingDB
Found 1 hit for monomerid = 20792
Trg + Lig
Ki
nM
ΔG°
kcal/mole
IC50
nM
Kd
nM
EC50/IC50
nM
koff
s-1
kon
M-1s-1
pHTemp
°C
Heat shock protein HSP 90-beta
(Homo sapiens (Human))
BDBM20792
(2-amino-6-halopurine analogue, 27 | 6-bromo-9-[(2-...)
Show SMILES COc1cc(Cn2cnc3c(Br)nc(N)nc23)c(Br)c(OC)c1OC
Show InChI InChI=1S/C15H15Br2N5O3/c1-23-8-4-7(9(16)12(25-3)11(8)24-2)5-22-6-19-10-13(17)20-15(18)21-14(10)22/h4,6H,5H2,1-3H3,(H2,18,20,21)
Reactome pathway
n/an/an/an/a 55n/an/a7.237
Biogen Idec
Assay Description
EC50 was defined as the concentration of the compound at which there was 50% degradation of the Her-2/neu protein in MCF7 breast carcinoma cells. Sam...
J Med Chem 50: 2767-78 (2007)
Article DOI: 10.1021/jm050752+
BindingDB Entry DOI: 10.7270/Q22Z13ST