BDBM20848 3-[2-(pyridin-4-yl)-1,3-thiazol-4-yl]-7-(trifluoromethyl)-1,2-dihydroquinolin-2-one::quinolin-2(1H)-one derivative, 9f
SMILES: FC(F)(F)c1ccc2cc(-c3csc(n3)-c3ccncc3)c(=O)[nH]c2c1
InChI Key: InChIKey=PNYMCFQCHXFMCI-UHFFFAOYSA-N
Data: 1 IC50
Activity Spreadsheet -- Enzyme Inhibition Constant Data from BindingDB
Found 1 hit for monomerid = 20848
Trg + Lig
Ki
nM
ΔG°
kcal/mole
IC50
nM
Kd
nM
EC50/IC50
nM
koff
s-1
kon
M-1s-1
pHTemp
°C
Cyclin-Dependent Kinase 5 (CDK5)
(Homo sapiens (Human))
BDBM20848
(3-[2-(pyridin-4-yl)-1,3-thiazol-4-yl]-7-(trifluoro...)
Show SMILES FC(F)(F)c1ccc2cc(-c3csc(n3)-c3ccncc3)c(=O)[nH]c2c1
Show InChI InChI=1S/C18H10F3N3OS/c19-18(20,21)12-2-1-11-7-13(16(25)23-14(11)8-12)15-9-26-17(24-15)10-3-5-22-6-4-10/h1-9H,(H,23,25)
NCI pathway
Reactome pathway
n/an/a 6.30n/an/an/an/a7.525
Amgen
Assay Description
In vitro CDK assay using purified enzyme, was incubated at 25 °C with substrate, and test compounds in the presence of ATP/ [gamma-33P] ATP. 33P...
Bioorg Med Chem Lett 17: 5384-9 (2007)
Article DOI: 10.1016/j.bmcl.2007.07.045
BindingDB Entry DOI: 10.7270/Q2TD9VNG