BDBM208637 US9266876, 104
SMILES: C[C@@H]1CN(CCN1C(=O)Cn1c2ncccc2[nH]c1=O)c1sc(nc1-c1nc2ccccc2[nH]1)C(F)(F)F
InChI Key: InChIKey=DYOFIXNFEMVOEC-CYBMUJFWSA-N
Data: 1 IC50
Activity Spreadsheet -- Enzyme Inhibition Constant Data from BindingDB
Found 1 hit for monomerid = 208637
Trg + Lig
Ki
nM
ΔG°
kcal/mole
IC50
nM
Kd
nM
EC50/IC50
nM
koff
s-1
kon
M-1s-1
pHTemp
°C
CXCR3A / G protein (Galpha(16))
(Homo sapiens (Human))
BDBM208637
(US9266876, 104)
Show SMILES C[C@@H]1CN(CCN1C(=O)Cn1c2ncccc2[nH]c1=O)c1sc(nc1-c1nc2ccccc2[nH]1)C(F)(F)F
Show InChI InChI=1S/C24H21F3N8O2S/c1-13-11-33(9-10-34(13)17(36)12-35-20-16(31-23(35)37)7-4-8-28-20)21-18(32-22(38-21)24(25,26)27)19-29-14-5-2-3-6-15(14)30-19/h2-8,13H,9-12H2,1H3,(H,29,30)(H,31,37)/t13-/m1/s1
US Patent
n/an/a 1n/an/an/an/a7.437
Actelion Pharmaceuticals Ltd.
US Patent
Assay Description
The bioactivity of compounds is tested in a fluorometric imaging plate reader (FLIPR: Molecular Devices) using engineered CHO-K1 cells expressing the...
US Patent US9266876 (2016)
BindingDB Entry DOI: 10.7270/Q2DB80NB