BDBM208723 US9266876, 190
SMILES: C[C@@H]1CN(CCN1C(=O)Cc1cccc2cccnc12)c1sc(nc1-c1nc2ccccc2[nH]1)C(F)(F)F
InChI Key: InChIKey=OUMWJLAXMADJFX-MRXNPFEDSA-N
Data: 1 IC50
Activity Spreadsheet -- Enzyme Inhibition Constant Data from BindingDB
Found 1 hit for monomerid = 208723
Trg + Lig
Ki
nM
ΔG°
kcal/mole
IC50
nM
Kd
nM
EC50/IC50
nM
koff
s-1
kon
M-1s-1
pHTemp
°C
CXCR3A / G protein (Galpha(16))
(Homo sapiens (Human))
BDBM208723
(US9266876, 190)
Show SMILES C[C@@H]1CN(CCN1C(=O)Cc1cccc2cccnc12)c1sc(nc1-c1nc2ccccc2[nH]1)C(F)(F)F
Show InChI InChI=1S/C27H23F3N6OS/c1-16-15-35(12-13-36(16)21(37)14-18-7-4-6-17-8-5-11-31-22(17)18)25-23(34-26(38-25)27(28,29)30)24-32-19-9-2-3-10-20(19)33-24/h2-11,16H,12-15H2,1H3,(H,32,33)/t16-/m1/s1
US Patent
n/an/a 1n/an/an/an/a7.437
Actelion Pharmaceuticals Ltd.
US Patent
Assay Description
The bioactivity of compounds is tested in a fluorometric imaging plate reader (FLIPR: Molecular Devices) using engineered CHO-K1 cells expressing the...
US Patent US9266876 (2016)
BindingDB Entry DOI: 10.7270/Q2DB80NB