BDBM208826 US9266878, 51a
SMILES: C[C@H](Nc1ncnc(N)c1C#Cc1ccccc1)c1nc2cccc(Cl)c2c(=O)n1-c1ccccc1
InChI Key: InChIKey=GUENWZOBCBBZGU-SFHVURJKSA-N
Data: 5 IC50
Activity Spreadsheet -- Enzyme Inhibition Constant Data from BindingDB
Found 5 hits for monomerid = 208826
Trg + Lig
Ki
nM
ΔG°
kcal/mole
IC50
nM
Kd
nM
EC50/IC50
nM
koff
s-1
kon
M-1s-1
pHTemp
°C
Phosphatidylinositol 4,5-bisphosphate 3-kinase catalytic subunit beta isoform
(Homo sapiens (Human))
BDBM208826
(US9266878, 51a)
Show SMILES C[C@H](Nc1ncnc(N)c1C#Cc1ccccc1)c1nc2cccc(Cl)c2c(=O)n1-c1ccccc1 |r|
Show InChI InChI=1S/C28H21ClN6O/c1-18(33-26-21(25(30)31-17-32-26)16-15-19-9-4-2-5-10-19)27-34-23-14-8-13-22(29)24(23)28(36)35(27)20-11-6-3-7-12-20/h2-14,17-18H,1H3,(H3,30,31,32,33)/t18-/m0/s1
NCI pathway
Reactome pathway
US Patent
n/an/a<100n/an/an/an/a7.425
Gilead Calistoga LLC
US Patent
Assay Description
PI3K isoforms were assayed under initial rate conditions in the presence of 25 mM Hepes (pH 7.4), and 2xKm ATP (100-300 uM), 10 uM PIP2, 5% glycerol,...
US Patent US9266878 (2016)
BindingDB Entry DOI: 10.7270/Q28K77W5
Phosphatidylinositol 4,5-bisphosphate 3-kinase catalytic subunit delta isoform
(Homo sapiens (Human))
BDBM208826
(US9266878, 51a)
Show SMILES C[C@H](Nc1ncnc(N)c1C#Cc1ccccc1)c1nc2cccc(Cl)c2c(=O)n1-c1ccccc1 |r|
Show InChI InChI=1S/C28H21ClN6O/c1-18(33-26-21(25(30)31-17-32-26)16-15-19-9-4-2-5-10-19)27-34-23-14-8-13-22(29)24(23)28(36)35(27)20-11-6-3-7-12-20/h2-14,17-18H,1H3,(H3,30,31,32,33)/t18-/m0/s1
NCI pathway
Reactome pathway
US Patent
n/an/a<100n/an/an/an/a7.425
Gilead Calistoga LLC
US Patent
Assay Description
PI3K isoforms were assayed under initial rate conditions in the presence of 25 mM Hepes (pH 7.4), and 2xKm ATP (100-300 uM), 10 uM PIP2, 5% glycerol,...
US Patent US9266878 (2016)
BindingDB Entry DOI: 10.7270/Q28K77W5
Phosphoinositide 3-Kinase (PI3K), delta
(Homo sapiens (Human))
BDBM208826
(US9266878, 51a)
Show SMILES C[C@H](Nc1ncnc(N)c1C#Cc1ccccc1)c1nc2cccc(Cl)c2c(=O)n1-c1ccccc1 |r|
Show InChI InChI=1S/C28H21ClN6O/c1-18(33-26-21(25(30)31-17-32-26)16-15-19-9-4-2-5-10-19)27-34-23-14-8-13-22(29)24(23)28(36)35(27)20-11-6-3-7-12-20/h2-14,17-18H,1H3,(H3,30,31,32,33)/t18-/m0/s1
NCI pathway
Reactome pathway
n/an/a 0.300n/an/an/an/an/an/a
Gilead Sciences, Inc.
Curated by ChEMBL
Assay Description
Inhibition human full length PI3Kdelta catalytic subunit/p85alpha assessed as formation of PIP3 after 30 mins by europium labeled GRP-based TR-FRET a...
J Med Chem 59: 3532-48 (2016)
BindingDB Entry DOI: 10.7270/Q22Z17F0
Phosphatidylinositol 4,5-bisphosphate 3-kinase catalytic subunit alpha isoform
(Homo sapiens (Human))
BDBM208826
(US9266878, 51a)
Show SMILES C[C@H](Nc1ncnc(N)c1C#Cc1ccccc1)c1nc2cccc(Cl)c2c(=O)n1-c1ccccc1 |r|
Show InChI InChI=1S/C28H21ClN6O/c1-18(33-26-21(25(30)31-17-32-26)16-15-19-9-4-2-5-10-19)27-34-23-14-8-13-22(29)24(23)28(36)35(27)20-11-6-3-7-12-20/h2-14,17-18H,1H3,(H3,30,31,32,33)/t18-/m0/s1
NCI pathway
Reactome pathway
US Patent
n/an/a 550n/an/an/an/a7.425
Gilead Calistoga LLC
US Patent
Assay Description
PI3K isoforms were assayed under initial rate conditions in the presence of 25 mM Hepes (pH 7.4), and 2xKm ATP (100-300 uM), 10 uM PIP2, 5% glycerol,...
US Patent US9266878 (2016)
BindingDB Entry DOI: 10.7270/Q28K77W5
Phosphatidylinositol 4,5-bisphosphate 3-kinase catalytic subunit gamma isoform
(Homo sapiens (Human))
BDBM208826
(US9266878, 51a)
Show SMILES C[C@H](Nc1ncnc(N)c1C#Cc1ccccc1)c1nc2cccc(Cl)c2c(=O)n1-c1ccccc1 |r|
Show InChI InChI=1S/C28H21ClN6O/c1-18(33-26-21(25(30)31-17-32-26)16-15-19-9-4-2-5-10-19)27-34-23-14-8-13-22(29)24(23)28(36)35(27)20-11-6-3-7-12-20/h2-14,17-18H,1H3,(H3,30,31,32,33)/t18-/m0/s1
NCI pathway
Reactome pathway
US Patent
n/an/a<100n/an/an/an/a7.425
Gilead Calistoga LLC
US Patent
Assay Description
PI3K isoforms were assayed under initial rate conditions in the presence of 25 mM Hepes (pH 7.4), and 2xKm ATP (100-300 uM), 10 uM PIP2, 5% glycerol,...
US Patent US9266878 (2016)
BindingDB Entry DOI: 10.7270/Q28K77W5